{"text_format":"1","workbook":"xlsx","n_sheets":15,"sheets":["目次・使い方","入力値チェック","シート①","シート②","シート③④","シート⑤","シート⑥","シート⑦","シート⑧","施工状況把握チェックシート","目視評価記録シート","シートA　打設予定報告","InputLimitCells","List_DEF","CheckList"],"not_rendered":{"charts":1,"images":3,"macros":1,"external_links":0,"defined_names":11,"comments":2,"pivot_tables":0},"unopened":[],"bounds":{"document_bytes":16777216,"sheet_cells":100000,"rows_first":2000,"rows_last":500,"rows_between":2000,"halvings":0,"cell_chars":16384,"cell_head_chars":4096},"cells_cut":0,"cells_raw":0,"read":"whole","date_system":"1900"}

{"sheet":"目次・使い方","index":0,"n_rows":52,"n_cols":4,"rows_kept":52,"cut":false,"hidden":false,"merged":[]}
[]
[]
[]
[]
[]
[]
[]
[]
[]
[]
[]
[]
[]
[]
[]
[null,"目次","シート名","表題"]
[null,null,"目次・使い方","(このシート)"]
[null,null,"入力値チェック"]
[null,null,"シート①","リフト図"]
[null,null,"シート②","コンクリート打込み管理表"]
[null,null,"シート③④","コンクリート打込み管理表（温度計測その1）"]
[null,null,null,"コンクリート打込み管理表（温度計測その2）"]
[null,null,"シート⑤","ひび割れ調査票（その1）"]
[null,null,"シート⑥","ひび割れ調査票（その2）"]
[null,null,"シート⑦","設計，施工対比確認表（その1）"]
[null,null,"シート⑧","設計，施工対比確認表（その2）"]
[null,null,"施工状況把握チェックシート","群馬県：施工状況把握チェックシート（コンクリート打込み時）"]
[null,null,"目視評価記録シート"]
[null,null,"シートA　打設予定報告"]
[]
[]
[]
[null,"使い方"]
[null,"　①データ入力"]
[null,null,"「シート①」「シート②」「シート③④」「シート⑤」「シート⑥」「シート⑦」「シート⑧」に施工記録を入力してください。"]
[]
[null,"　②入力値チェック"]
[null,null,"本シートをコンクリート構造物品質確保データベースに登録する際は、事前に入力値に問題がないか確認するチェックに合格する必要があります。"]
[null,null,"入力値チェックシートの「入力値チェック開始ボタン」をクリックすると、チェックが開始します。"]
[]
[null,null,"◎エラーが存在する場合"]
[null,null,"　エラーが存在する場合は、入力値チェックシートにエラー箇所とエラー内容が表示されます。"]
[null,null,"　当該箇所を確認し、エラーがなくなるまで修正してください。"]
[]
[null,null,"◎エラーが存在しない場合"]
[null,null,"　エラーが存在しない場合は、入力値チェックシートの入力チェック結果に「エラーはありません。」と表示されます。"]
[null,null,"　エラーがないことを確認できたら、そのまま保存して下さい。"]
[]
[null,"注意"]
[null,"　※エラーチェック後の入力値を編集すると、コンクリート構造物品質確保データベースに登録することができません。"]
[null,"　　　チェック後に編集した場合はもう一度チェックを行ってください。"]
[null,"　※エラーチェック後に本シートの印刷範囲設定は変更しないでください。"]

{"sheet":"入力値チェック","index":1,"n_rows":16,"n_cols":7,"rows_kept":16,"cut":false,"hidden":false,"merged":[]}
["入力値チェックシート"]
[]
[]
[null,null,null,"入力値チェックボタン"]
[]
[]
[]
["要チェックメッセージ",null,null,null,{"$f":"IF(0<COUNTIF(CheckList!I3:I800,\"D\"),\"新たに入力された箇所があります。入力値チェックボタンを押してチェックをしてください。\",\"新たに入力された箇所はありません。\")","v":"新たに入力された箇所があります。入力値チェックボタンを押してチェックをしてください。"}]
[null,null,null,null,"※「新たに入力された箇所はありません。」でないとシステムに登録できません。"]
[]
["入力値チェック結果",null,null,null,{"$f":"IF(0<$D$14,\"エラーがあります。下記表に示された箇所を修正してください。\",IF(0<COUNTIF(CheckList!I3:I800,\"D\"),\"未チェックです。\",IF(0=CheckList!$AB$2,\"すべてのチェック項目が未入力です。\",\"エラーはありません。\")))","v":"未チェックです。"}]
[null,null,null,null,"※「エラーはありません。」でないとシステムに登録できません。"]
[]
[null,"エラー数",null,{"$f":"COUNTA($D$17:INDIRECT(\"$D\" & TEXT((17)+MAX(CheckList!A3:A800),\"@\")))","v":0},"　※チェックに合格した後は、入力値の変更や印刷範囲設定の変更はせず、そのまま保存して下さい。"]
[]
[null,null,null,"通番","シート名","列・行","エラー内容"]

{"sheet":"シート①","index":2,"n_rows":46,"n_cols":15,"rows_kept":46,"cut":false,"hidden":false,"merged":[[45,11,45,14],[36,8,36,10],[37,8,37,10],[44,2,45,2],[44,3,45,6],[41,2,42,3],[37,2,37,4],[45,8,45,10],[34,2,34,4],[34,5,34,6],[36,2,36,4],[43,2,43,4],[43,5,43,6],[6,1,6,2],[8,1,8,2],[7,1,7,2],[7,3,7,14],[38,8,39,10],[38,11,39,12],[39,2,40,3],[6,13,6,14],[6,10,6,11],[6,3,6,8],[35,9,35,10],[33,9,33,10],[32,5,32,6],[33,5,33,6],[32,11,32,12],[34,9,34,10],[1,0,1,14],[3,8,3,9],[3,10,3,14],[3,1,3,2],[3,3,3,7],[4,13,4,14],[4,1,4,2],[4,3,4,7],[41,8,41,10],[42,8,42,10],[8,10,8,14],[8,8,8,9],[8,3,8,7],[32,2,32,4],[33,2,33,4],[5,13,5,14],[4,10,4,11],[5,3,5,11],[5,1,5,2],[4,8,4,9],[11,1,11,14]]}
[null,null,null,null,null,null,null,null,null,null,null,null,null,null,"記録シート①"]
["リフト図"]
["○基本情報"]
[null,"発注者(事務所名)",null,"前橋土木事務所",null,null,null,null,"受注者",null,"○○建設（株）"]
[null,"路線・河川・地区等",null,"県道○○号　○○橋下部工事",null,null,null,null,"工期",null,"2017-04-01",null,"～","2018-03-01"]
[null,"工事名",null,"○○○工事",null,null,null,null,null,null,null,null,"工区",2]
[null,"施工場所",null,"○○市○○地内",null,null,null,null,null,"緯度","36°55′15″",null,"経度","122°56′1″"]
[null,"構造物名",null,"○○橋"]
[null,"構造物詳細",null,"A1橋台",null,null,null,null,"リフト名",null,"第2リフト"]
[]
[]
[null,"打込みリフト図"]
[]
[]
[]
[]
[]
[]
[]
[]
[]
[]
[]
[]
[]
[]
[]
[]
[]
[]
[]
[null,null,"○構造",null,null,null,null,null,"○ひび割れ抑制対策"]
[null,null,"構造物種類",null,null,"橋台",null,null,"補強鉄筋",null,null,"タイプA"]
[null,null,"構造形式",null,null,"RC構造",null,null,null,"配筋状況（タイプA）",null,"D19","@125"]
[null,null,"打込み部位",null,null,"たて壁",null,null,null,"タイプA段数",null,"1","段"]
[null,null,"○寸法",null,null,null,null,null,null,"配筋状況（タイプB)"]
[null,null,"厚さ",null,null,2.2000000000000002,"m",null,"誘発目地間隔",null,null,null,"m"]
[null,null,"長さ（幅）",null,null,10.1,"m",null,"膨張材",null,null,null,"kg/m3"]
[null,null,"○配筋",null,null,null,null,null,"その他の対策"]
[null,null,"主鉄筋",null,"前面","D29","@125"]
[null,null,null,null,"背面","D29","@125",null,"○鉄筋比"]
[null,null,"配力筋",null,"前面","D19","@125",null,"鉄筋比（対策前）",null,null,0.11,"%"]
[null,null,null,null,"背面","D19","@125",null,"鉄筋比（実　施）",null,null,0.3,"%"]
[null,null,"設計純かぶり",null,null,"40mm"]
[null,null,"申し送り事項"]
[null,null,null,null,null,null,null,null,"リフトID",null,null,"mihon"]

{"sheet":"シート②","index":3,"n_rows":42,"n_cols":15,"rows_kept":42,"cut":false,"hidden":false,"merged":[[1,1,1,14],[3,1,3,2],[3,3,3,7],[3,8,3,9],[3,10,3,11],[3,13,3,14],[4,1,4,2],[4,3,4,11],[4,13,4,14],[5,1,5,2],[5,3,5,14],[6,1,6,2],[6,3,6,7],[6,8,6,9],[6,10,6,14],[12,2,12,3],[12,4,12,5],[12,6,12,7],[12,8,12,9],[13,2,13,3],[13,4,13,14],[9,1,13,1],[9,2,9,3],[9,6,9,7],[9,10,9,11],[10,2,10,3],[10,6,10,7],[11,2,11,3],[11,4,11,5],[11,6,11,7],[11,8,11,14],[16,13,16,14],[17,2,17,3],[17,4,17,5],[17,7,17,8],[17,10,17,11],[14,2,14,3],[14,4,14,6],[14,7,14,9],[14,10,14,12],[14,13,14,14],[15,2,15,3],[15,4,15,5],[15,7,15,8],[15,10,15,11],[15,13,15,14],[14,1,21,1],[20,2,20,3],[20,4,20,5],[20,7,20,8],[20,10,20,11],[21,2,21,3],[21,4,21,5],[21,7,21,8],[21,10,21,11],[18,2,18,3],[18,4,18,5],[18,7,18,8],[18,10,18,11],[19,2,19,3],[19,4,19,5],[19,7,19,8],[19,10,19,11],[16,2,16,3],[16,4,16,5],[16,7,16,8],[16,10,16,11],[24,13,24,14],[25,1,25,2],[25,3,25,6],[25,7,25,8],[25,9,25,14],[26,1,27,2],[26,3,26,4],[26,7,26,8],[26,11,26,12],[27,3,27,4],[24,1,24,2],[24,3,24,6],[24,7,24,8],[24,9,24,10],[24,11,24,12],[29,7,29,8],[29,11,29,12],[30,1,31,2],[30,3,30,4],[30,7,30,8],[30,11,30,12],[31,3,31,4],[31,7,31,14],[27,5,27,6],[27,7,27,8],[27,11,27,12],[28,1,29,2],[28,3,28,4],[28,5,28,6],[28,7,28,8],[28,9,28,10],[28,11,28,14],[29,3,29,4],[39,1,40,2],[39,3,39,4],[39,5,39,14],[40,3,40,4],[40,5,40,14],[41,1,41,4],[41,7,41,14],[34,1,34,2],[34,5,34,6],[34,9,34,10],[35,1,35,4],[38,1,38,4],[38,5,38,9],[38,10,38,12]]}
[null,null,null,null,null,null,null,null,null,null,null,null,null,null,"記録シート②"]
[null,"コンクリート打込み管理表"]
["○基本情報"]
[null,"路線・河川・地区等",null,{"$f":"IF(シート①!D5=\"\",\"\",シート①!D5)","v":"県道○○号　○○橋下部工事"},null,null,null,null,"工期",null,{"$f":"IF(シート①!K5=\"\",\"\",シート①!K5)","v":"2017-04-01"},null,"～",{"$f":"IF(シート①!N5=\"\",\"\",シート①!N5)","v":"2018-03-01"}]
[null,"工事名",null,{"$f":"IF(シート①!D6=\"\",\"\",シート①!D6)","v":"○○○工事"},null,null,null,null,null,null,null,null,"工区",{"$f":"IF(シート①!N6=\"\",\"\",シート①!N6)","v":2}]
[null,"構造物名",null,{"$f":"IF(シート①!D8=\"\",\"\",シート①!D8)","v":"○○橋"}]
[null,"構造物詳細",null,{"$f":"IF(シート①!D9=\"\",\"\",シート①!D9)","v":"A1橋台"},null,null,null,null,"リフト名",null,{"$f":"IF(シート①!K9=\"\",\"\",シート①!K9)","v":"第2リフト"}]
[]
["○コンクリート"]
[null,"材\n料\n・\n配\n合","呼び強度",null,27,"N/mm2","スランプ",null,8,"cm","骨材最大寸法",null,20,"mm"]
[null,null,"水セメント比",null,55,"%","単位ｾﾒﾝﾄ量",null,300,"kg/m3"]
[null,null,"セメント種類",null,"高炉B種",null,"セメント会社",null,"○○セメント（株）"]
[null,null,"混和剤",null,"AE減水剤",null,"混和材",null,"---"]
[null,null,"生コン工場",null,"○○（株）　○○工場"]
[null,"品\n質\n管\n理\n試\n験","試料採取時期",null,"打込み開始時",null,null,"150m3打込み時又は午後",null,null,"300m3打込み時",null,null,"試験許容値"]
[null,null,"スランプ",null,9,null,"cm",null,null,"cm",null,null,"cm","8±2.5cm"]
[null,null,"空気量",null,5.5,null,"%",null,null,"%",null,null,"%","4.5±1.5%"]
[null,null,"塩化物イオン量",null,0.03,null,"kg/m3",null,null,"kg/m3",null,null,"kg/m3","0.3","kg/m3以下"]
[null,null,"ｺﾝｸﾘｰﾄ温度",null,24,null,"℃",null,null,"℃",null,null,"℃"]
[null,null,"打込み時外気温",null,22,null,"℃",null,null,"℃",null,null,"℃"]
[null,null,"7日強度",null,19,null,"N/mm2",null,null,"N/mm2",null,null,"N/mm2"]
[null,null,"28日強度",null,31,null,"N/mm2",null,null,"N/mm2",null,null,"N/mm2"]
[]
["○運搬・打込み・締固め"]
[null,"打込み日",null,"2017-05-25",null,null,null,"天気",null,"曇りのち晴",null,"下側ﾘﾌﾄ打込み日",null,"2017-05-10"]
[null,"型枠種類",null,"塗装合板",null,null,null,"下側ﾘﾌﾄ打継目処理",null,"処理剤（○○）"]
[null,"運搬",null,"現場までの運搬時間",null,20,"分","現場待機時間",null,0,"分","荷卸し時間",null,20,"分/台"]
[null,null,null,"現場内運搬方法",null,"ポンプ（配管なし）",null,"ポンプ圧送距離",null,0,"m","ポンプ車台数",null,1,"台"]
[null,"打込み",null,"開始時刻",null,"08:10:00",null,"終了時刻",null,"11:00:00"]
[null,null,null,"リフト高",null,3,"m","打込み量",null,70,"m3","打込み速度",null,1,"m/h"]
[null,"締固め",null,"ﾊﾞｲﾌﾞﾚｰﾀ台数",null,3,"台","ﾊﾞｲﾌﾞﾚｰﾀ人数",null,4,"人","ﾊﾞｲﾌﾞﾚｰﾀ予備",null,1,"台"]
[null,null,null,"ホース筒先",null,1,"人"]
[]
["○コンクリート温度履歴"]
[null,"初期温度",null,24,"℃","最高温度",null,48,"℃","温度上昇量",null,{"$f":"H35-D35","v":24},"℃"]
[null,"最高温度に到達した時間",null,null,null,30,"時間後"]
[]
["○養生"]
[null,"脱型日",null,null,null,"2017-06-05",null,null,null,null,"残置期間",null,null,{"$f":"IF(OR($D$25=\"\",$F$39-$D$25<=0),\"\",$F$39-$D$25)","v":11},"日"]
[null,"養生方法",null,"型枠面",null,"型枠＋ブルーシート"]
[null,null,null,"打込み面",null,"養生マット＋ブルーシート＋散水"]
[null,"養生（湿潤状態）期間",null,null,null,7,"日"]

{"sheet":"シート③④","index":4,"n_rows":104,"n_cols":22,"rows_kept":104,"cut":false,"hidden":false,"merged":[[78,1,79,2],[77,1,77,2],[74,1,74,2],[75,1,76,2],[69,1,69,2],[109,1,109,2],[103,1,103,14],[104,1,104,2],[105,1,105,2],[106,1,106,2],[107,1,107,2],[108,1,108,2],[102,1,102,2],[101,10,101,14],[73,10,73,14],[74,10,74,14],[75,10,75,14],[76,10,76,14],[72,10,72,14],[71,10,71,14],[87,10,87,14],[88,10,88,14],[97,10,97,14],[98,10,98,14],[27,1,28,2],[62,1,62,2],[38,1,38,2],[56,1,56,2],[60,1,61,2],[89,1,89,2],[59,1,59,2],[101,1,101,2],[93,1,94,2],[83,1,83,2],[92,1,92,2],[90,1,91,2],[98,1,98,2],[99,1,100,2],[95,1,95,2],[96,1,97,2],[72,1,73,2],[84,1,85,2],[87,1,88,2],[68,1,68,2],[86,1,86,2],[80,1,80,2],[81,1,82,2],[67,1,67,2],[20,10,20,14],[21,10,21,14],[22,10,22,14],[15,1,16,2],[43,10,43,14],[44,10,44,14],[1,0,1,14],[64,0,64,14],[39,1,40,2],[41,1,41,2],[42,1,43,2],[20,1,20,2],[24,1,25,2],[51,1,52,2],[36,1,37,2],[21,1,22,2],[35,1,35,2],[30,1,31,2],[50,1,50,2],[23,1,23,2],[11,1,11,2],[4,3,4,11],[6,8,6,9],[14,10,14,14],[57,1,58,2],[32,1,32,2],[48,1,49,2],[45,1,46,2],[53,1,53,2],[54,1,55,2],[33,1,34,2],[66,1,66,2],[47,1,47,2],[44,1,44,2],[3,1,3,2],[3,3,3,7],[3,8,3,9],[5,1,5,2],[4,1,4,2],[5,3,5,14],[4,13,4,14],[12,10,12,14],[13,10,13,14],[3,13,3,14],[8,10,8,14],[3,10,3,11],[6,10,6,14],[6,1,6,2],[12,1,13,2],[9,10,9,14],[10,10,10,14],[11,10,11,14],[14,1,14,2],[6,3,6,7],[9,1,10,2],[31,10,31,14],[32,10,32,14],[33,10,33,14],[34,10,34,14],[27,10,27,14],[28,10,28,14],[29,10,29,14],[30,10,30,14],[23,10,23,14],[24,10,24,14],[25,10,25,14],[26,10,26,14],[15,10,15,14],[16,10,16,14],[17,10,17,14],[18,10,18,14],[19,10,19,14],[29,1,29,2],[17,1,17,2],[18,1,19,2],[26,1,26,2],[45,10,45,14],[46,10,46,14],[39,10,39,14],[40,10,40,14],[41,10,41,14],[42,10,42,14],[35,10,35,14],[36,10,36,14],[37,10,37,14],[38,10,38,14],[56,10,56,14],[60,10,60,14],[61,10,61,14],[62,10,62,14],[66,8,66,9],[47,10,47,14],[57,10,57,14],[58,10,58,14],[59,10,59,14],[50,10,50,14],[51,10,51,14],[52,10,52,14],[53,10,53,14],[54,10,54,14],[55,10,55,14],[48,10,48,14],[49,10,49,14],[66,10,66,11],[66,13,66,14],[67,13,67,14],[69,10,69,14],[67,3,67,11],[69,8,69,9],[68,3,68,14],[69,3,69,7],[66,3,66,7],[85,10,85,14],[86,10,86,14],[81,10,81,14],[82,10,82,14],[83,10,83,14],[84,10,84,14],[77,10,77,14],[78,10,78,14],[79,10,79,14],[80,10,80,14],[99,10,99,14],[100,10,100,14],[93,10,93,14],[94,10,94,14],[95,10,95,14],[96,10,96,14],[89,10,89,14],[90,10,90,14],[91,10,91,14],[92,10,92,14]]}
[null,null,null,null,null,null,null,null,null,null,null,null,null,null,"記録シート③"]
["コンクリート打込み管理表（温度計測その1）"]
["○基本情報"]
[null,"路線・河川・地区等",null,{"$f":"IF(シート①!D5=\"\",\"\",シート①!D5)","v":"県道○○号　○○橋下部工事"},null,null,null,null,"工期",null,{"$f":"IF(シート①!K5=\"\",\"\",シート①!K5)","v":"2017-04-01"},null,"～",{"$f":"IF(シート①!N5=\"\",\"\",シート①!N5)","v":"2018-03-01"}]
[null,"工事名",null,{"$f":"IF(シート①!D6=\"\",\"\",シート①!D6)","v":"○○○工事"},null,null,null,null,null,null,null,null,"工区",{"$f":"IF(シート①!N6=\"\",\"\",シート①!N6)","v":2}]
[null,"構造物名",null,{"$f":"IF(シート①!D8=\"\",\"\",シート①!D8)","v":"○○橋"}]
[null,"構造物詳細",null,{"$f":"IF(シート①!D9=\"\",\"\",シート①!D9)","v":"A1橋台"},null,null,null,null,"リフト名",null,{"$f":"IF(シート①!K9=\"\",\"\",シート①!K9)","v":"第2リフト"}]
[]
[null,"日時",null,null,"天気","計測\n時刻","ｺﾝｸﾘｰﾄ温度",null,"外気温",null,"備　　　考"]
[null,{"$f":"IF(\"\"<>シート②!D25,シート②!D25,\"\")","v":"2017-05-25"},null,null,"晴","15:00:00",38,"℃",23,"℃",null,null,null,null,null,null,null,null,null,{"$f":"G10","v":38},{"$f":"B10-$B$10+F10-$F$10","v":0},{"$f":"IF(I10=0,IF(I13=0,I9-(I9-I16)/(U9-U16)*(U9-U10),IF(I7=0,#REF!-(#REF!-I13)/(#REF!-U13)*(#REF!-U10),I9-(I9-I13)/(U9-U13)*(U9-U10))),I10)","v":23}]
[null,null,null,null,null,null,null,null,null,null,null,null,null,null,null,null,null,null,null,{"$f":"IF(G11=0,T10,G11)","v":38},{"$f":"IF(F11=0,U10,B10-$B$10+F11-$F$10)","v":0},{"$f":"IF(I11=0,V10,I11)","v":23}]
[null,{"$f":"IFERROR(IF(B10=0,0,IF(WEEKDAY(B10,2)=1,\"(月)\",IF(WEEKDAY(B10,2)=2,\"(火)\",IF(WEEKDAY(B10,2)=3,\"(水)\",IF(WEEKDAY(B10,2)=4,\"(木)\",IF(WEEKDAY(B10,2)=5,\"(金)\",IF(WEEKDAY(B10,2)=6,\"(土)\",\"(日)\"))))))),\"\")","v":"(木)"},null,null,null,null,null,null,null,null,null,null,null,null,null,null,null,null,null,38,{"$f":"IF(F12=0,U11,B10-$B$10+F12-$F$10)","v":0},23]
[null,{"$f":"IF(B10=\"\",\"\",B10+1)","v":"2017-05-26"},null,"朝","晴","08:00:00",47,"℃",22,"℃",null,null,null,null,null,null,null,null,null,47,{"$f":"IF(F13=0,U12,B13-$B$10+F13-$F$10)","v":0.70833333333333326},{"$f":"IF(I13=0,V12,I13)","v":22}]
[null,null,null,"昼","晴","13:00:00",47.5,"℃",26,"℃",null,null,null,null,null,null,null,null,null,47.5,{"$f":"IF(F14=0,U13,B13-$B$10+F14-$F$10)","v":0.91666666666666652},26]
[null,{"$f":"IF(B13=\"\",\"\",IF(WEEKDAY(B13,2)=1,\"(月)\",IF(WEEKDAY(B13,2)=2,\"(火)\",IF(WEEKDAY(B13,2)=3,\"(水)\",IF(WEEKDAY(B13,2)=4,\"(木)\",IF(WEEKDAY(B13,2)=5,\"(金)\",IF(WEEKDAY(B13,2)=6,\"(土)\",\"(日)\")))))))","v":"(金)"},null,"夕","晴","17:00:00",48,"℃",23,"℃",null,null,null,null,null,null,null,null,null,48,{"$f":"IF(F15=0,U14,B13-$B$10+F15-$F$10)","v":1.0833333333333335},23]
[null,{"$f":"IF(B13=\"\",\"\",B13+1)","v":"2017-05-27"},null,"朝","晴","08:00:00",45,"℃",22,"℃",null,null,null,null,null,null,null,null,null,45,{"$f":"IF(F16=0,U15,B16-$B$10+F16-$F$10)","v":1.7083333333333335},22]
[null,null,null,"昼","晴","13:00:00",43,"℃",26,"℃",null,null,null,null,null,null,null,null,null,43,{"$f":"IF(F17=0,U16,B16-$B$10+F17-$F$10)","v":1.9166666666666665},26]
[null,{"$f":"IF(B16=\"\",\"\",IF(WEEKDAY(B16,2)=1,\"(月)\",IF(WEEKDAY(B16,2)=2,\"(火)\",IF(WEEKDAY(B16,2)=3,\"(水)\",IF(WEEKDAY(B16,2)=4,\"(木)\",IF(WEEKDAY(B16,2)=5,\"(金)\",IF(WEEKDAY(B16,2)=6,\"(土)\",\"(日)\")))))))","v":"(土)"},null,"夕","晴","17:00:00",42,"℃",23,"℃",null,null,null,null,null,null,null,null,null,42,{"$f":"IF(F18=0,U17,B16-$B$10+F18-$F$10)","v":2.0833333333333335},23]
[null,{"$f":"IF(B16=\"\",\"\",B16+1)","v":"2017-05-28"},null,"朝","晴","09:30:00",38,"℃",22,"℃",null,null,null,null,null,null,null,null,null,38,{"$f":"IF(F19=0,U18,B19-$B$10+F19-$F$10)","v":2.7708333333333335},22]
[null,null,null,"昼","晴",null,null,"℃",null,"℃",null,null,null,null,null,null,null,null,null,38,{"$f":"IF(F20=0,U19,B19-$B$10+F20-$F$10)","v":2.7708333333333335},22]
[null,{"$f":"IF(B19=\"\",\"\",IF(WEEKDAY(B19,2)=1,\"(月)\",IF(WEEKDAY(B19,2)=2,\"(火)\",IF(WEEKDAY(B19,2)=3,\"(水)\",IF(WEEKDAY(B19,2)=4,\"(木)\",IF(WEEKDAY(B19,2)=5,\"(金)\",IF(WEEKDAY(B19,2)=6,\"(土)\",\"(日)\")))))))","v":"(日)"},null,"夕","晴",null,null,"℃",null,"℃",null,null,null,null,null,null,null,null,null,38,{"$f":"IF(F21=0,U20,B19-$B$10+F21-$F$10)","v":2.7708333333333335},22]
[null,{"$f":"IF(B19=\"\",\"\",B19+1)","v":"2017-05-29"},null,"朝","晴","08:00:00",30,"℃",22,"℃",null,null,null,null,null,null,null,null,null,30,{"$f":"IF(F22=0,U21,B22-$B$10+F22-$F$10)","v":3.708333333333333},22]
[null,null,null,"昼","晴","13:00:00",29,"℃",26,"℃",null,null,null,null,null,null,null,null,null,29,{"$f":"IF(F23=0,U22,B22-$B$10+F23-$F$10)","v":3.916666666666667},26]
[null,{"$f":"IF(B22=\"\",\"\",IF(WEEKDAY(B22,2)=1,\"(月)\",IF(WEEKDAY(B22,2)=2,\"(火)\",IF(WEEKDAY(B22,2)=3,\"(水)\",IF(WEEKDAY(B22,2)=4,\"(木)\",IF(WEEKDAY(B22,2)=5,\"(金)\",IF(WEEKDAY(B22,2)=6,\"(土)\",\"(日)\")))))))","v":"(月)"},null,"夕","晴","17:00:00",28,"℃",23,"℃",null,null,null,null,null,null,null,null,null,28,{"$f":"IF(F24=0,U23,B22-$B$10+F24-$F$10)","v":4.083333333333333},23]
[null,{"$f":"IF(B22=\"\",\"\",B22+1)","v":"2017-05-30"},null,"朝","晴","08:00:00",27,"℃",22,"℃",null,null,null,null,null,null,null,null,null,27,{"$f":"IF(F25=0,U24,B25-$B$10+F25-$F$10)","v":4.708333333333333},22]
[null,null,null,"昼","晴","13:00:00",26.5,"℃",26,"℃",null,null,null,null,null,null,null,null,null,26.5,{"$f":"IF(F26=0,U25,B25-$B$10+F26-$F$10)","v":4.916666666666667},26]
[null,{"$f":"IF(B25=\"\",\"\",IF(WEEKDAY(B25,2)=1,\"(月)\",IF(WEEKDAY(B25,2)=2,\"(火)\",IF(WEEKDAY(B25,2)=3,\"(水)\",IF(WEEKDAY(B25,2)=4,\"(木)\",IF(WEEKDAY(B25,2)=5,\"(金)\",IF(WEEKDAY(B25,2)=6,\"(土)\",\"(日)\")))))))","v":"(火)"},null,"夕","晴","17:00:00",26,"℃",23,"℃",null,null,null,null,null,null,null,null,null,26,{"$f":"IF(F27=0,U26,B25-$B$10+F27-$F$10)","v":5.083333333333333},23]
[null,{"$f":"IF(B25=\"\",\"\",B25+1)","v":"2017-05-31"},null,"朝","晴","08:00:00",25.5,"℃",22,"℃",null,null,null,null,null,null,null,null,null,25.5,{"$f":"IF(F28=0,U27,B28-$B$10+F28-$F$10)","v":5.708333333333333},22]
[null,null,null,"昼","晴","13:00:00",25,"℃",26,"℃",null,null,null,null,null,null,null,null,null,25,{"$f":"IF(F29=0,U28,B28-$B$10+F29-$F$10)","v":5.916666666666667},26]
[null,{"$f":"IF(B28=\"\",\"\",IF(WEEKDAY(B28,2)=1,\"(月)\",IF(WEEKDAY(B28,2)=2,\"(火)\",IF(WEEKDAY(B28,2)=3,\"(水)\",IF(WEEKDAY(B28,2)=4,\"(木)\",IF(WEEKDAY(B28,2)=5,\"(金)\",IF(WEEKDAY(B28,2)=6,\"(土)\",\"(日)\")))))))","v":"(水)"},null,"夕","晴","17:00:00",24.5,"℃",23,"℃",null,null,null,null,null,null,null,null,null,24.5,{"$f":"IF(F30=0,U29,B28-$B$10+F30-$F$10)","v":6.083333333333333},23]
[null,{"$f":"IF(B28=\"\",\"\",B28+1)","v":"2017-06-01"},null,"朝","晴","08:00:00",24,"℃",23,"℃",null,null,null,null,null,null,null,null,null,24,{"$f":"IF(F31=0,U30,B31-$B$10+F31-$F$10)","v":6.708333333333333},23]
[null,null,null,"昼","晴","13:00:00",23.9,"℃",27,"℃",null,null,null,null,null,null,null,null,null,23.9,{"$f":"IF(F32=0,U31,B31-$B$10+F32-$F$10)","v":6.916666666666667},27]
[null,{"$f":"IF(B31=\"\",\"\",IF(WEEKDAY(B31,2)=1,\"(月)\",IF(WEEKDAY(B31,2)=2,\"(火)\",IF(WEEKDAY(B31,2)=3,\"(水)\",IF(WEEKDAY(B31,2)=4,\"(木)\",IF(WEEKDAY(B31,2)=5,\"(金)\",IF(WEEKDAY(B31,2)=6,\"(土)\",\"(日)\")))))))","v":"(木)"},null,"夕","晴","17:00:00",23.8,"℃",24,"℃",null,null,null,null,null,null,null,null,null,23.8,{"$f":"IF(F33=0,U32,B31-$B$10+F33-$F$10)","v":7.083333333333333},24]
[null,{"$f":"IF(B31=\"\",\"\",B31+1)","v":"2017-06-02"},null,"朝","晴","08:00:00",23.7,"℃",23,"℃",null,null,null,null,null,null,null,null,null,23.7,{"$f":"IF(F34=0,U33,B34-$B$10+F34-$F$10)","v":7.7083333333333339},23]
[null,null,null,"昼","晴","13:00:00",23.6,"℃",27,"℃",null,null,null,null,null,null,null,null,null,23.6,{"$f":"IF(F35=0,U34,B34-$B$10+F35-$F$10)","v":7.9166666666666661},27]
[null,{"$f":"IF(B34=\"\",\"\",IF(WEEKDAY(B34,2)=1,\"(月)\",IF(WEEKDAY(B34,2)=2,\"(火)\",IF(WEEKDAY(B34,2)=3,\"(水)\",IF(WEEKDAY(B34,2)=4,\"(木)\",IF(WEEKDAY(B34,2)=5,\"(金)\",IF(WEEKDAY(B34,2)=6,\"(土)\",\"(日)\")))))))","v":"(金)"},null,"夕","晴","17:00:00",23.5,"℃",24,"℃",null,null,null,null,null,null,null,null,null,23.5,{"$f":"IF(F36=0,U35,B34-$B$10+F36-$F$10)","v":8.0833333333333339},24]
[null,{"$f":"IF(B34=\"\",\"\",B34+1)","v":"2017-06-03"},null,"朝",null,null,null,"℃",null,"℃",null,null,null,null,null,null,null,null,null,23.5,{"$f":"IF(F37=0,U36,B37-$B$10+F37-$F$10)","v":8.0833333333333339},24]
[null,null,null,"昼",null,null,null,"℃",null,"℃",null,null,null,null,null,null,null,null,null,23.5,{"$f":"IF(F38=0,U37,B37-$B$10+F38-$F$10)","v":8.0833333333333339},24]
[null,{"$f":"IF(B37=\"\",\"\",IF(WEEKDAY(B37,2)=1,\"(月)\",IF(WEEKDAY(B37,2)=2,\"(火)\",IF(WEEKDAY(B37,2)=3,\"(水)\",IF(WEEKDAY(B37,2)=4,\"(木)\",IF(WEEKDAY(B37,2)=5,\"(金)\",IF(WEEKDAY(B37,2)=6,\"(土)\",\"(日)\")))))))","v":"(土)"},null,"夕",null,null,null,"℃",null,"℃",null,null,null,null,null,null,null,null,null,23.5,{"$f":"IF(F39=0,U38,B37-$B$10+F39-$F$10)","v":8.0833333333333339},24]
[null,{"$f":"IF(B37=\"\",\"\",B37+1)","v":"2017-06-04"},null,"朝",null,null,null,"℃",null,"℃",null,null,null,null,null,null,null,null,null,23.5,{"$f":"IF(F40=0,U39,B40-$B$10+F40-$F$10)","v":8.0833333333333339},24]
[null,null,null,"昼",null,null,null,"℃",null,"℃",null,null,null,null,null,null,null,null,null,23.5,{"$f":"IF(F41=0,U40,B40-$B$10+F41-$F$10)","v":8.0833333333333339},24]
[null,{"$f":"IF(B40=\"\",\"\",IF(WEEKDAY(B40,2)=1,\"(月)\",IF(WEEKDAY(B40,2)=2,\"(火)\",IF(WEEKDAY(B40,2)=3,\"(水)\",IF(WEEKDAY(B40,2)=4,\"(木)\",IF(WEEKDAY(B40,2)=5,\"(金)\",IF(WEEKDAY(B40,2)=6,\"(土)\",\"(日)\")))))))","v":"(日)"},null,"夕",null,null,null,"℃",null,"℃",null,null,null,null,null,null,null,null,null,23.5,{"$f":"IF(F42=0,U41,B40-$B$10+F42-$F$10)","v":8.0833333333333339},24]
[null,{"$f":"IF(B40=\"\",\"\",B40+1)","v":"2017-06-05"},null,"朝","晴","08:00:00",22.8,"℃",23,"℃",null,null,null,null,null,null,null,null,null,22.8,{"$f":"IF(F43=0,U42,B43-$B$10+F43-$F$10)","v":10.708333333333334},23]
[null,null,null,"昼","晴","13:00:00",22.7,"℃",27,"℃",null,null,null,null,null,null,null,null,null,22.7,{"$f":"IF(F44=0,U43,B43-$B$10+F44-$F$10)","v":10.916666666666666},27]
[null,{"$f":"IF(B43=\"\",\"\",IF(WEEKDAY(B43,2)=1,\"(月)\",IF(WEEKDAY(B43,2)=2,\"(火)\",IF(WEEKDAY(B43,2)=3,\"(水)\",IF(WEEKDAY(B43,2)=4,\"(木)\",IF(WEEKDAY(B43,2)=5,\"(金)\",IF(WEEKDAY(B43,2)=6,\"(土)\",\"(日)\")))))))","v":"(月)"},null,"夕","晴","17:00:00",22.6,"℃",24,"℃",null,null,null,null,null,null,null,null,null,22.6,{"$f":"IF(F45=0,U44,B43-$B$10+F45-$F$10)","v":11.083333333333334},24]
[null,{"$f":"IF(B43=\"\",\"\",B43+1)","v":"2017-06-06"},null,"朝","晴","08:00:00",22.5,"℃",23,"℃",null,null,null,null,null,null,null,null,null,22.5,{"$f":"IF(F46=0,U45,B46-$B$10+F46-$F$10)","v":11.708333333333334},23]
[null,null,null,"昼","晴","13:00:00",22.4,"℃",27,"℃",null,null,null,null,null,null,null,null,null,22.4,{"$f":"IF(F47=0,U46,B46-$B$10+F47-$F$10)","v":11.916666666666666},27]
[null,{"$f":"IF(B46=\"\",\"\",IF(WEEKDAY(B46,2)=1,\"(月)\",IF(WEEKDAY(B46,2)=2,\"(火)\",IF(WEEKDAY(B46,2)=3,\"(水)\",IF(WEEKDAY(B46,2)=4,\"(木)\",IF(WEEKDAY(B46,2)=5,\"(金)\",IF(WEEKDAY(B46,2)=6,\"(土)\",\"(日)\")))))))","v":"(火)"},null,"夕","晴","17:00:00",22.3,"℃",24,"℃",null,null,null,null,null,null,null,null,null,22.3,{"$f":"IF(F48=0,U47,B46-$B$10+F48-$F$10)","v":12.083333333333334},24]
[null,{"$f":"IF(B46=\"\",\"\",B46+1)","v":"2017-06-07"},null,"朝","晴","08:00:00",22.2,"℃",23,"℃",null,null,null,null,null,null,null,null,null,22.2,{"$f":"IF(F49=0,U48,B49-$B$10+F49-$F$10)","v":12.708333333333334},23]
[null,null,null,"昼","晴","13:00:00",22.1,"℃",27,"℃",null,null,null,null,null,null,null,null,null,22.1,{"$f":"IF(F50=0,U49,B49-$B$10+F50-$F$10)","v":12.916666666666666},27]
[null,{"$f":"IF(B49=\"\",\"\",IF(WEEKDAY(B49,2)=1,\"(月)\",IF(WEEKDAY(B49,2)=2,\"(火)\",IF(WEEKDAY(B49,2)=3,\"(水)\",IF(WEEKDAY(B49,2)=4,\"(木)\",IF(WEEKDAY(B49,2)=5,\"(金)\",IF(WEEKDAY(B49,2)=6,\"(土)\",\"(日)\")))))))","v":"(水)"},null,"夕","晴","17:00:00",22,"℃",24,"℃",null,null,null,null,null,null,null,null,null,22,{"$f":"IF(F51=0,U50,B49-$B$10+F51-$F$10)","v":13.083333333333334},24]
[null,{"$f":"IF(B49=\"\",\"\",B49+1)","v":"2017-06-08"},null,"朝","晴","08:00:00",21.9,"℃",23,"℃",null,null,null,null,null,null,null,null,null,21.9,{"$f":"IF(F52=0,U51,B52-$B$10+F52-$F$10)","v":13.708333333333334},23]
[null,null,null,"昼","晴","13:00:00",21.8,"℃",28,"℃",null,null,null,null,null,null,null,null,null,21.8,{"$f":"IF(F53=0,U52,B52-$B$10+F53-$F$10)","v":13.916666666666666},28]
[null,null,null,"夕","晴","17:00:00",21.7,"℃",25,"℃",null,null,null,null,null,null,null,null,null,21.7,{"$f":"IF(F54=0,U53,B52-$B$10+F54-$F$10)","v":14.083333333333334},25]
[null,{"$f":"IF(B52=\"\",\"\",B52+1)","v":"2017-06-09"},null,"朝","晴","08:00:00",21.6,"℃",23,"℃",null,null,null,null,null,null,null,null,null,21.6,{"$f":"IF(F55=0,U54,B55-$B$10+F55-$F$10)","v":14.708333333333334},23]
[null,null,null,"昼","晴","13:00:00",21.5,"℃",28,"℃",null,null,null,null,null,null,null,null,null,21.5,{"$f":"IF(F56=0,U55,B55-$B$10+F56-$F$10)","v":14.916666666666666},28]
[null,{"$f":"IF(B55=\"\",\"\",IF(WEEKDAY(B55,2)=1,\"(月)\",IF(WEEKDAY(B55,2)=2,\"(火)\",IF(WEEKDAY(B55,2)=3,\"(水)\",IF(WEEKDAY(B55,2)=4,\"(木)\",IF(WEEKDAY(B55,2)=5,\"(金)\",IF(WEEKDAY(B55,2)=6,\"(土)\",\"(日)\")))))))","v":"(金)"},null,"夕","晴","17:00:00",21.4,"℃",25,"℃",null,null,null,null,null,null,null,null,null,21.4,{"$f":"IF(F57=0,U56,B55-$B$10+F57-$F$10)","v":15.083333333333334},25]
[null,{"$f":"IF(B55=\"\",\"\",B55+1)","v":"2017-06-10"},null,"朝","晴","08:00:00",21.3,"℃",23,"℃",null,null,null,null,null,null,null,null,null,{"$f":"IF(G58=0,T57,G58)","v":21.3},{"$f":"IF(F58=0,U57,B58-$B$10+F58-$F$10)","v":15.708333333333332},23]
[null,null,null,"昼","晴","13:00:00",21.4,"℃",28,"℃",null,null,null,null,null,null,null,null,null,21.4,{"$f":"IF(F59=0,U58,B58-$B$10+F59-$F$10)","v":15.916666666666668},28]
[null,{"$f":"IF(B58=\"\",\"\",IF(WEEKDAY(B58,2)=1,\"(月)\",IF(WEEKDAY(B58,2)=2,\"(火)\",IF(WEEKDAY(B58,2)=3,\"(水)\",IF(WEEKDAY(B58,2)=4,\"(木)\",IF(WEEKDAY(B58,2)=5,\"(金)\",IF(WEEKDAY(B58,2)=6,\"(土)\",\"(日)\")))))))","v":"(土)"},null,"夕","晴","17:00:00",21.5,"℃",25,"℃",null,null,null,null,null,null,null,null,null,21.5,{"$f":"IF(F60=0,U59,B58-$B$10+F60-$F$10)","v":16.083333333333332},{"$f":"IF(I60=0,V59,I60)","v":25}]
[null,{"$f":"IF(B58=\"\",\"\",B58+1)","v":"2017-06-11"},null,"朝",null,null,null,"℃",null,"℃",null,null,null,null,null,null,null,null,null,21.5,{"$f":"IF(F61=0,U60,B61-$B$10+F61-$F$10)","v":16.083333333333332},{"$f":"IF(I61=0,V60,I61)","v":25}]
[null,null,null,"昼",null,null,null,"℃",null,"℃",null,null,null,null,null,null,null,null,null,21.5,{"$f":"IF(F62=0,U61,B61-$B$10+F62-$F$10)","v":16.083333333333332},{"$f":"IF(I62=0,V61,I62)","v":25}]
[null,{"$f":"IF(B61=\"\",\"\",IF(WEEKDAY(B61,2)=1,\"(月)\",IF(WEEKDAY(B61,2)=2,\"(火)\",IF(WEEKDAY(B61,2)=3,\"(水)\",IF(WEEKDAY(B61,2)=4,\"(木)\",IF(WEEKDAY(B61,2)=5,\"(金)\",IF(WEEKDAY(B61,2)=6,\"(土)\",\"(日)\")))))))","v":"(日)"},null,"夕",null,null,null,"℃",null,"℃",null,null,null,null,null,null,null,null,null,{"$f":"IF(G63=0,T62,G63)","v":21.5},{"$f":"IF(F63=0,U62,B61-$B$10+F63-$F$10)","v":16.083333333333332},{"$f":"IF(I63=0,V62,I63)","v":25}]
[null,null,null,null,null,null,null,null,null,null,null,null,null,null,"記録シート④",null,null,null,null,{"$f":"IF(G73=0,T63,G73)","v":21.9},{"$f":"IF(F73=0,U63,B73-$B$10+F82-$F$10)","v":17.708333333333332},{"$f":"IF(I73=0,V63,I73)","v":23}]
["コンクリート打込み管理表（温度計測その2）",null,null,null,null,null,null,null,null,null,null,null,null,null,null,null,null,null,null,21.9,{"$f":"IF(F74=0,U64,B73-$B$10+F74-$F$10)","v":17.708333333333332},23]
["○基本情報",null,null,null,null,null,null,null,null,null,null,null,null,null,null,null,null,null,null,21.9,{"$f":"IF(F75=0,U65,B73-$B$10+F75-$F$10)","v":17.708333333333332},23]
[null,"路線・河川・地区等",null,{"$f":"D4","v":"県道○○号　○○橋下部工事"},null,null,null,null,"工期",null,{"$f":"K4","v":"2017-04-01"},null,"～",{"$f":"N4","v":"2018-03-01"},null,null,null,null,null,22,{"$f":"IF(F76=0,U66,B76-$B$10+F76-$F$10)","v":18.708333333333332},23]
[null,"工事名",null,{"$f":"D5","v":"○○○工事"},null,null,null,null,null,null,null,null,"工区",{"$f":"N5","v":2},null,null,null,null,null,22,{"$f":"IF(F77=0,U67,B76-$B$10+F77-$F$10)","v":18.708333333333332},23]
[null,"構造物名",null,{"$f":"D6","v":"○○橋"},null,null,null,null,null,null,null,null,null,null,null,null,null,null,null,22,{"$f":"IF(F78=0,U68,B76-$B$10+F78-$F$10)","v":18.708333333333332},23]
[null,"構造物詳細",null,{"$f":"D7","v":"A1橋台"},null,null,null,null,"リフト名",null,{"$f":"K7","v":"第2リフト"},null,null,null,null,null,null,null,null,22,{"$f":"IF(F79=0,U69,B79-$B$10+F79-$F$10)","v":19.708333333333332},23]
[null,null,null,null,null,null,null,null,null,null,null,null,null,null,null,null,null,null,null,22,{"$f":"IF(F80=0,U70,B79-$B$10+F80-$F$10)","v":19.708333333333332},23]
[null,"日時",null,null,"天気","計測\n時刻","ｺﾝｸﾘｰﾄ温度",null,"外気温",null,"備　　　考",null,null,null,null,null,null,null,null,22,{"$f":"IF(F81=0,U71,B79-$B$10+F81-$F$10)","v":19.708333333333332},23]
[null,{"$f":"IF(B61=\"\",\"\",B61+1)","v":"2017-06-12"},null,"朝","晴","08:00:00",21.9,"℃",23,"℃",null,null,null,null,null,null,null,null,null,22,{"$f":"IF(F82=0,U72,B82-$B$10+F82-$F$10)","v":20.708333333333332},23]
[null,null,null,"昼",null,null,null,"℃",null,"℃",null,null,null,null,null,null,null,null,null,22,{"$f":"IF(F83=0,U73,B82-$B$10+F83-$F$10)","v":20.708333333333332},23]
[null,{"$f":"IF(B73=\"\",\"\",IF(WEEKDAY(B73,2)=1,\"(月)\",IF(WEEKDAY(B73,2)=2,\"(火)\",IF(WEEKDAY(B73,2)=3,\"(水)\",IF(WEEKDAY(B73,2)=4,\"(木)\",IF(WEEKDAY(B73,2)=5,\"(金)\",IF(WEEKDAY(B73,2)=6,\"(土)\",\"(日)\")))))))","v":"(月)"},null,"夕",null,null,null,"℃",null,"℃",null,null,null,null,null,null,null,null,null,22,{"$f":"IF(F84=0,U74,B82-$B$10+F84-$F$10)","v":20.708333333333332},23]
[null,{"$f":"IF(B73=\"\",\"\",B73+1)","v":"2017-06-13"},null,"朝","晴","08:00:00",22,"℃",23,"℃",null,null,null,null,null,null,null,null,null,22,{"$f":"IF(F85=0,U75,B85-$B$10+F85-$F$10)","v":21.708333333333332},23]
[null,null,null,"昼",null,null,null,"℃",null,"℃",null,null,null,null,null,null,null,null,null,22,{"$f":"IF(F86=0,U76,B85-$B$10+F86-$F$10)","v":21.708333333333332},23]
[null,{"$f":"IF(B76=\"\",\"\",IF(WEEKDAY(B76,2)=1,\"(月)\",IF(WEEKDAY(B76,2)=2,\"(火)\",IF(WEEKDAY(B76,2)=3,\"(水)\",IF(WEEKDAY(B76,2)=4,\"(木)\",IF(WEEKDAY(B76,2)=5,\"(金)\",IF(WEEKDAY(B76,2)=6,\"(土)\",\"(日)\")))))))","v":"(火)"},null,"夕",null,null,null,"℃",null,"℃",null,null,null,null,null,null,null,null,null,22,{"$f":"IF(F87=0,U77,B85-$B$10+F87-$F$10)","v":21.708333333333332},23]
[null,{"$f":"IF(B76=\"\",\"\",B76+1)","v":"2017-06-14"},null,"朝","晴","08:00:00",22,"℃",23,"℃",null,null,null,null,null,null,null,null,null,22,{"$f":"IF(F88=0,U78,B88-$B$10+F88-$F$10)","v":21.708333333333332},23]
[null,null,null,"昼",null,null,null,"℃",null,"℃",null,null,null,null,null,null,null,null,null,22,{"$f":"IF(F89=0,U79,B88-$B$10+F89-$F$10)","v":21.708333333333332},23]
[null,{"$f":"IF(B79=\"\",\"\",IF(WEEKDAY(B79,2)=1,\"(月)\",IF(WEEKDAY(B79,2)=2,\"(火)\",IF(WEEKDAY(B79,2)=3,\"(水)\",IF(WEEKDAY(B79,2)=4,\"(木)\",IF(WEEKDAY(B79,2)=5,\"(金)\",IF(WEEKDAY(B79,2)=6,\"(土)\",\"(日)\")))))))","v":"(水)"},null,"夕",null,null,null,"℃",null,"℃",null,null,null,null,null,null,null,null,null,22,{"$f":"IF(F90=0,U80,B88-$B$10+F90-$F$10)","v":21.708333333333332},23]
[null,{"$f":"IF(B79=\"\",\"\",B79+1)","v":"2017-06-15"},null,"朝","晴","08:00:00",22,"℃",23,"℃",null,null,null,null,null,null,null,null,null,22,{"$f":"IF(F91=0,U81,B91-$B$10+F91-$F$10)","v":21.708333333333332},23]
[null,null,null,"昼",null,null,null,"℃",null,"℃",null,null,null,null,null,null,null,null,null,22,{"$f":"IF(F92=0,U82,B91-$B$10+F92-$F$10)","v":21.708333333333332},23]
[null,{"$f":"IF(B82=\"\",\"\",IF(WEEKDAY(B82,2)=1,\"(月)\",IF(WEEKDAY(B82,2)=2,\"(火)\",IF(WEEKDAY(B82,2)=3,\"(水)\",IF(WEEKDAY(B82,2)=4,\"(木)\",IF(WEEKDAY(B82,2)=5,\"(金)\",IF(WEEKDAY(B82,2)=6,\"(土)\",\"(日)\")))))))","v":"(木)"},null,"夕",null,null,null,"℃",null,"℃",null,null,null,null,null,null,null,null,null,22,{"$f":"IF(F93=0,U83,B91-$B$10+F93-$F$10)","v":21.708333333333332},23]
[null,{"$f":"IF(B82=\"\",\"\",B82+1)","v":"2017-06-16"},null,"朝","晴","08:00:00",22,"℃",23,"℃",null,null,null,null,null,null,null,null,null,22.3,{"$f":"IF(F94=0,U84,B94-$B$10+F94-$F$10)","v":24.708333333333332},23.5]
[null,null,null,"昼",null,null,null,"℃",null,"℃",null,null,null,null,null,null,null,null,null,22.3,{"$f":"IF(F95=0,U85,B94-$B$10+F95-$F$10)","v":24.708333333333332},23.5]
[null,{"$f":"IF(B85=\"\",\"\",IF(WEEKDAY(B85,2)=1,\"(月)\",IF(WEEKDAY(B85,2)=2,\"(火)\",IF(WEEKDAY(B85,2)=3,\"(水)\",IF(WEEKDAY(B85,2)=4,\"(木)\",IF(WEEKDAY(B85,2)=5,\"(金)\",IF(WEEKDAY(B85,2)=6,\"(土)\",\"(日)\")))))))","v":"(金)"},null,"夕",null,null,null,"℃",null,"℃",null,null,null,null,null,null,null,null,null,22.3,{"$f":"IF(F96=0,U86,B94-$B$10+F96-$F$10)","v":24.708333333333332},23.5]
[null,{"$f":"IF(B85=\"\",\"\",B85+1)","v":"2017-06-17"},null,"朝",null,null,null,"℃",null,"℃",null,null,null,null,null,null,null,null,null,22.4,{"$f":"IF(F97=0,U87,B97-$B$10+F97-$F$10)","v":25.708333333333332},23.5]
[null,null,null,"昼",null,null,null,"℃",null,"℃",null,null,null,null,null,null,null,null,null,22.4,{"$f":"IF(F98=0,U88,B97-$B$10+F98-$F$10)","v":25.708333333333332},23.5]
[null,{"$f":"IF(B88=\"\",\"\",IF(WEEKDAY(B88,2)=1,\"(月)\",IF(WEEKDAY(B88,2)=2,\"(火)\",IF(WEEKDAY(B88,2)=3,\"(水)\",IF(WEEKDAY(B88,2)=4,\"(木)\",IF(WEEKDAY(B88,2)=5,\"(金)\",IF(WEEKDAY(B88,2)=6,\"(土)\",\"(日)\")))))))","v":"(土)"},null,"夕",null,null,null,"℃",null,"℃",null,null,null,null,null,null,null,null,null,22.4,{"$f":"IF(F99=0,U89,B97-$B$10+F99-$F$10)","v":25.708333333333332},23.5]
[null,{"$f":"IF(B88=\"\",\"\",B88+1)","v":"2017-06-18"},null,"朝",null,null,null,"℃",null,"℃",null,null,null,null,null,null,null,null,null,22.5,{"$f":"IF(F100=0,U90,B100-$B$10+F100-$F$10)","v":26.708333333333332},23.5]
[null,null,null,"昼",null,null,null,"℃",null,"℃",null,null,null,null,null,null,null,null,null,22.5,{"$f":"IF(F101=0,U91,B100-$B$10+F101-$F$10)","v":26.708333333333332},23.5]
[null,{"$f":"IF(B91=\"\",\"\",IF(WEEKDAY(B91,2)=1,\"(月)\",IF(WEEKDAY(B91,2)=2,\"(火)\",IF(WEEKDAY(B91,2)=3,\"(水)\",IF(WEEKDAY(B91,2)=4,\"(木)\",IF(WEEKDAY(B91,2)=5,\"(金)\",IF(WEEKDAY(B91,2)=6,\"(土)\",\"(日)\")))))))","v":"(日)"},null,"夕",null,null,null,"℃",null,"℃",null,null,null,null,null,null,null,null,null,22.5,{"$f":"IF(F102=0,U92,B100-$B$10+F102-$F$10)","v":26.708333333333332},23.5]
[null,{"$f":"IF(B91=\"\",\"\",B91+1)","v":"2017-06-19"},null,"朝","晴","08:00:00",22.3,"℃",23.5,"℃"]
[null,null,null,"昼",null,null,null,"℃",null,"℃"]
[null,{"$f":"IF(B94=\"\",\"\",IF(WEEKDAY(B94,2)=1,\"(月)\",IF(WEEKDAY(B94,2)=2,\"(火)\",IF(WEEKDAY(B94,2)=3,\"(水)\",IF(WEEKDAY(B94,2)=4,\"(木)\",IF(WEEKDAY(B94,2)=5,\"(金)\",IF(WEEKDAY(B94,2)=6,\"(土)\",\"(日)\")))))))","v":"(月)"},null,"夕",null,null,null,"℃",null,"℃"]
[null,{"$f":"IF(B94=\"\",\"\",B94+1)","v":"2017-06-20"},null,"朝","晴","08:00:00",22.4,"℃",23.5,"℃"]
[null,null,null,"昼",null,null,null,"℃",null,"℃"]
[null,{"$f":"IF(B97=\"\",\"\",IF(WEEKDAY(B97,2)=1,\"(月)\",IF(WEEKDAY(B97,2)=2,\"(火)\",IF(WEEKDAY(B97,2)=3,\"(水)\",IF(WEEKDAY(B97,2)=4,\"(木)\",IF(WEEKDAY(B97,2)=5,\"(金)\",IF(WEEKDAY(B97,2)=6,\"(土)\",\"(日)\")))))))","v":"(火)"},null,"夕",null,null,null,"℃",null,"℃"]
[null,{"$f":"IF(B97=\"\",\"\",B97+1)","v":"2017-06-21"},null,"朝","晴","08:00:00",22.5,"℃",23.5,"℃"]
[null,null,null,"昼",null,null,null,"℃",null,"℃"]
[null,{"$f":"IF(B100=\"\",\"\",IF(WEEKDAY(B100,2)=1,\"(月)\",IF(WEEKDAY(B100,2)=2,\"(火)\",IF(WEEKDAY(B100,2)=3,\"(水)\",IF(WEEKDAY(B100,2)=4,\"(木)\",IF(WEEKDAY(B100,2)=5,\"(金)\",IF(WEEKDAY(B100,2)=6,\"(土)\",\"(日)\")))))))","v":"(水)"},null,"夕",null,null,null,"℃",null,"℃"]
[]
[null,"コンクリート温度・外気温計測結果"]

{"sheet":"シート⑤","index":5,"n_rows":12,"n_cols":15,"rows_kept":12,"cut":false,"hidden":false,"merged":[[1,1,1,14],[3,8,3,9],[4,3,4,11],[4,13,4,14],[3,1,3,2],[4,1,4,2],[3,3,3,7],[6,3,6,7],[5,3,5,14],[3,10,3,11],[3,13,3,14],[9,1,9,3],[6,1,6,2],[6,8,6,9],[5,1,5,2],[6,10,6,14]]}
[null,null,null,null,null,null,null,null,null,null,null,null,null,null,"記録シート⑤"]
[null,"ひび割れ調査票（その1）"]
["○基本情報"]
[null,"路線・河川・地区等",null,{"$f":"IF(シート①!D5=\"\",\"\",シート①!D5)","v":"県道○○号　○○橋下部工事"},null,null,null,null,"工期",null,{"$f":"IF(シート①!K5=\"\",\"\",シート①!K5)","v":"2017-04-01"},null,"～",{"$f":"IF(シート①!N5=\"\",\"\",シート①!N5)","v":"2018-03-01"}]
[null,"工事名",null,{"$f":"IF(シート①!D6=\"\",\"\",シート①!D6)","v":"○○○工事"},null,null,null,null,null,null,null,null,"工区",{"$f":"IF(シート①!N6=\"\",\"\",シート①!N6)","v":2}]
[null,"構造物名",null,{"$f":"IF(シート①!D8=\"\",\"\",シート①!D8)","v":"○○橋"}]
[null,"構造物詳細",null,{"$f":"IF(シート①!D9=\"\",\"\",シート①!D9)","v":"A1橋台"},null,null,null,null,"リフト名",null,{"$f":"IF(シート①!K9=\"\",\"\",シート①!K9)","v":"第2リフト"}]
[]
["○ひび割れの有無"]
[null,"ひび割れの有無",null,null,"有"]
[]
["○ひび割れ概要"]

{"sheet":"シート⑥","index":6,"n_rows":31,"n_cols":15,"rows_kept":31,"cut":false,"hidden":false,"merged":[[1,1,1,14],[11,2,11,3],[17,2,17,3],[3,8,3,9],[3,10,3,11],[3,13,3,14],[13,2,13,3],[6,1,6,2],[4,3,4,11],[10,2,10,3],[4,13,4,14],[4,1,4,2],[6,10,6,14],[6,8,6,9],[5,3,5,14],[9,1,12,1],[3,1,3,2],[3,3,3,7],[30,4,30,14],[27,1,30,1],[18,2,18,3],[30,2,30,3],[29,2,29,3],[25,2,26,3],[28,2,28,3],[27,2,27,3],[25,4,26,14],[13,1,26,1],[24,2,24,3],[22,2,22,3],[6,3,6,7],[9,2,9,3],[5,1,5,2],[15,2,15,3],[21,2,21,3],[20,2,20,3],[23,2,23,3],[16,2,16,3],[14,2,14,3],[19,2,19,3],[12,2,12,3]]}
[null,null,null,null,null,null,null,null,null,null,null,null,null,null,"記録シート⑥"]
[null,"ひび割れ調査票（その2）"]
["○基本情報"]
[null,"路線・河川・地区等",null,{"$f":"IF(シート①!D5=\"\",\"\",シート①!D5)","v":"県道○○号　○○橋下部工事"},null,null,null,null,"工期",null,{"$f":"IF(シート①!K5=\"\",\"\",シート①!K5)","v":"2017-04-01"},null,"～",{"$f":"IF(シート①!N5=\"\",\"\",シート①!N5)","v":"2018-03-01"}]
[null,"工事名",null,{"$f":"IF(シート①!D6=\"\",\"\",シート①!D6)","v":"○○○工事"},null,null,null,null,null,null,null,null,"工区",{"$f":"IF(シート①!N6=\"\",\"\",シート①!N6)","v":2}]
[null,"構造物名",null,{"$f":"IF(シート①!D8=\"\",\"\",シート①!D8)","v":"○○橋"}]
[null,"構造物詳細",null,{"$f":"IF(シート①!D9=\"\",\"\",シート①!D9)","v":"A1橋台"},null,null,null,null,"リフト名",null,{"$f":"IF(シート①!K9=\"\",\"\",シート①!K9)","v":"第2リフト"}]
[]
["○ひび割れ状況"]
[null,"ひび割れ","No.",null,"No.1","No.2","No.3","No.4","No.5","No.6","No.7","No.8","No.9","No.10","No.11"]
[null,null,"位置",null,"正面"]
[null,null,"形状",null,"貫通"]
[null,null,"方向",null,"鉛直"]
[null,"調査日","2017-06-05",null,0.15]
[null,null,"2017-06-12",null,0.15]
[null,null,"2017-06-19",null,0.15]
[null,null,"2017-06-26",null,0.2]
[null,null,"2017-07-03",null,0.25]
[]
[]
[]
[]
[]
[]
[]
[null,null,"備考",null,""]
[]
[null,"補修","補修の有無",null,"有"]
[null,null,"補修日",null,"2017-07-25"]
[null,null,"補修方法",null,"注入"]
[null,null,"備考",null,"軟質系エポキシ樹脂注入"]

{"sheet":"シート⑦","index":7,"n_rows":44,"n_cols":15,"rows_kept":44,"cut":false,"hidden":false,"merged":[[33,8,33,9],[27,5,27,7],[27,8,27,10],[27,11,27,14],[28,5,28,7],[32,1,36,1],[36,9,36,10],[36,2,36,4],[36,5,36,7],[36,11,36,14],[35,2,35,4],[35,5,35,7],[35,8,35,10],[35,11,35,14],[34,2,34,4],[34,5,34,6],[34,8,34,9],[34,11,34,14],[32,2,32,4],[32,5,32,7],[32,8,32,10],[32,11,32,14],[33,2,33,4],[33,11,33,14],[33,5,33,6],[25,8,25,10],[30,5,30,7],[30,8,30,10],[30,11,30,14],[31,2,31,4],[26,5,26,7],[26,8,26,10],[26,11,26,14],[25,11,25,14],[25,1,25,4],[26,1,31,1],[29,2,29,4],[29,11,29,14],[29,5,29,6],[29,8,29,9],[28,8,28,10],[28,11,28,14],[26,2,26,4],[27,2,27,4],[28,2,28,4],[30,2,30,4],[31,5,31,7],[31,8,31,10],[31,11,31,14],[22,8,22,10],[22,11,22,14],[23,1,23,4],[23,11,23,14],[24,1,24,4],[24,8,24,9],[24,11,24,14],[16,1,18,2],[16,3,16,4],[17,3,17,4],[18,3,18,4],[16,9,16,10],[17,9,17,10],[18,9,18,10],[22,1,22,4],[22,5,22,7],[23,5,23,7],[23,8,23,10],[24,5,24,6],[19,1,19,4],[15,8,15,10],[16,5,16,7],[17,5,17,7],[18,5,18,7],[19,5,19,7],[19,9,19,10],[19,11,19,14],[13,11,13,14],[14,11,14,14],[15,11,15,14],[16,11,18,14],[14,5,14,7],[15,5,15,7],[13,1,13,4],[14,1,14,4],[15,1,15,4],[9,1,9,4],[10,1,10,4],[11,1,11,4],[12,1,12,4],[25,5,25,7],[6,3,6,7],[6,8,6,9],[6,10,6,14],[9,5,9,7],[10,5,10,6],[11,5,11,6],[12,5,12,6],[13,5,13,7],[14,8,14,10],[9,11,9,14],[10,11,10,14],[9,8,9,10],[10,8,10,9],[11,8,11,9],[12,8,12,9],[13,8,13,10],[11,11,11,14],[12,11,12,14],[40,1,40,4],[40,11,40,14],[41,1,41,4],[41,5,41,6],[41,8,41,9],[41,11,41,14],[40,5,40,6],[40,8,40,9],[1,1,1,14],[3,1,3,2],[3,3,3,7],[3,8,3,9],[3,10,3,11],[3,13,3,14],[39,1,39,4],[39,5,39,7],[39,8,39,10],[39,11,39,14],[4,1,4,2],[4,3,4,11],[4,13,4,14],[5,1,5,2],[5,3,5,14],[6,1,6,2]]}
[null,null,null,null,null,null,null,null,null,null,null,null,null,null,"記録シート⑦"]
[null,"設計，施工対比確認表（その1）"]
["○基本情報"]
[null,"路線・河川・地区等",null,{"$f":"IF(シート①!D5=\"\",\"\",シート①!D5)","v":"県道○○号　○○橋下部工事"},null,null,null,null,"工期",null,{"$f":"IF(シート①!K5=\"\",\"\",シート①!K5)","v":"2017-04-01"},null,"～",{"$f":"IF(シート①!N5=\"\",\"\",シート①!N5)","v":"2018-03-01"}]
[null,"工事名",null,{"$f":"IF(シート①!D6=\"\",\"\",シート①!D6)","v":"○○○工事"},null,null,null,null,null,null,null,null,"工区",{"$f":"IF(シート①!N6=\"\",\"\",シート①!N6)","v":2}]
[null,"構造物名",null,{"$f":"IF(シート①!D8=\"\",\"\",シート①!D8)","v":"○○橋"}]
[null,"構造物詳細",null,{"$f":"IF(シート①!D9=\"\",\"\",シート①!D9)","v":"A1橋台"},null,null,null,null,"リフト名",null,{"$f":"IF(シート①!K9=\"\",\"\",シート①!K9)","v":"第2リフト"}]
[]
["○確実な充填"]
[null,"項目",null,null,null,"設計",null,null,"施工",null,null,"備考"]
[null,"最小鉄筋間隔",null,null,null,null,null,"mm",null,null,"mm","打込みに影響するもの"]
[null,"最小スランプ",null,null,null,null,null,"cm",null,null,"cm","設計値/想定値"]
[null,"発注スランプ",null,null,null,null,null,"cm",null,null,"cm","設計値/実際"]
[null,"流動化剤の後添加有無"]
[null,"打込み時の一時鉄筋移動"]
[null,"コンクリートの施工性",null,null,null,null,null,null,null,null,null,"施工者の評価"]
[null,"初期欠陥の\n有無/程度",null,"豆板",null,null,null,null,null,null,null,"有無/程度"]
[null,null,null,"ｺｰﾙﾄﾞｼﾞｮｲﾝﾄ"]
[null,null,null,"沈みひび割れ"]
[null,"補修の有無/方法",null,null,null,null,null,null,null,null,null,"有無/方法"]
[]
["○ひび割れ抑制"]
[null,"項目",null,null,null,"設計",null,null,"施工",null,null,"備考"]
[null,"温度ひび割れ検討",null,null,null,null,null,null,null,null,null,"対象/対象外"]
[null,"温度ひび割れ幅の限界値",null,null,null,null,null,"mm",null,null,"mm"]
[null,"照査方法"]
[null,"条件","打込み時期"]
[null,null,"打込み温度"]
[null,null,"外気温"]
[null,null,"リフト高",null,null,null,null,"m",null,null,"m"]
[null,null,"セメントの種類"]
[null,null,"断熱温度上昇特性"]
[null,"結果","ひび割れ指数"]
[null,null,"最大ひび割れ幅",null,null,null,null,"mm",null,null,"mm"]
[null,null,"最高温度",null,null,null,null,"℃",null,null,"℃"]
[null,null,"ひび割れ抑制対策"]
[null,null,"補修の有無/方法",null,null,null,null,null,null,null,null,"有無/方法"]
[]
["○かぶり（厚さ）の確保"]
[null,"項目",null,null,null,"設計",null,null,"施工",null,null,"備考"]
[null,"最小かぶり※1",null,null,null,null,null,"mm",null,null,"mm"]
[null,"誤差の想定値※2",null,null,null,null,null,"mm",null,null,"mm"]
[null,"※1：施工は非破壊試験査による実測値"]
[null,"※2：施工は非破壊試験の測定誤差の想定値"]

{"sheet":"シート⑧","index":8,"n_rows":20,"n_cols":15,"rows_kept":20,"cut":false,"hidden":false,"merged":[[10,1,10,4],[10,5,10,7],[1,1,1,14],[3,1,3,2],[3,3,3,7],[3,8,3,9],[3,10,3,11],[3,13,3,14],[6,1,6,2],[6,3,6,7],[6,8,6,9],[6,10,6,14],[9,1,9,4],[9,5,9,7],[9,8,9,10],[9,11,9,14],[4,1,4,2],[4,3,4,11],[4,13,4,14],[5,1,5,2],[5,3,5,14],[10,8,10,10],[10,11,10,14],[18,1,18,4],[19,5,19,7],[19,8,19,10],[19,11,19,14],[17,5,17,7],[17,8,17,10],[17,11,17,14],[18,5,18,7],[18,8,18,10],[18,11,18,14],[19,1,19,4],[11,1,11,4],[11,5,11,7],[11,8,11,10],[11,11,11,14],[17,1,17,4],[13,11,13,14],[14,11,14,14],[13,1,13,4],[13,5,13,6],[13,8,13,9],[14,1,14,4],[14,5,14,7],[14,8,14,10],[12,1,12,4],[12,11,12,14],[12,5,12,7],[12,8,12,10]]}
[null,null,null,null,null,null,null,null,null,null,null,null,null,null,"記録シート⑧"]
[null,"設計，施工対比確認表（その2）"]
["○基本情報"]
[null,"路線・河川・地区等",null,{"$f":"IF(シート①!D5=\"\",\"\",シート①!D5)","v":"県道○○号　○○橋下部工事"},null,null,null,null,"工期",null,{"$f":"IF(シート①!K5=\"\",\"\",シート①!K5)","v":"2017-04-01"},null,"～",{"$f":"IF(シート①!N5=\"\",\"\",シート①!N5)","v":"2018-03-01"}]
[null,"工事名",null,{"$f":"IF(シート①!D6=\"\",\"\",シート①!D6)","v":"○○○工事"},null,null,null,null,null,null,null,null,"工区",{"$f":"IF(シート①!N6=\"\",\"\",シート①!N6)","v":2}]
[null,"構造物名",null,{"$f":"IF(シート①!D8=\"\",\"\",シート①!D8)","v":"○○橋"}]
[null,"構造物詳細",null,{"$f":"IF(シート①!D9=\"\",\"\",シート①!D9)","v":"A1橋台"},null,null,null,null,"リフト名",null,{"$f":"IF(シート①!K9=\"\",\"\",シート①!K9)","v":"第2リフト"}]
[]
["○密実性確保"]
[null,"項目",null,null,null,"設計",null,null,"施工",null,null,"備考"]
[null,"環境条件"]
[null,"セメントの種類"]
[null,"水セメント比"]
[null,"空気量",null,null,null,null,null,"%",null,null,"%"]
[null,"養生方法"]
[]
["○排水・防水対策"]
[null,"項目",null,null,null,"設計",null,null,"施工",null,null,"備考"]
[null,"防水対策の有無"]
[null,"セメントの種類"]

{"sheet":"施工状況把握チェックシート","index":9,"n_rows":48,"n_cols":14,"rows_kept":48,"cut":false,"hidden":false,"merged":[[3,0,3,1],[3,2,3,5],[3,6,3,7],[3,8,3,11],[0,0,0,13],[2,0,2,1],[2,2,2,5],[2,6,2,7],[2,8,2,11],[4,0,4,1],[4,2,4,5],[4,6,4,7],[4,8,4,13],[5,0,5,1],[5,2,5,5],[5,6,5,7],[5,8,5,13],[7,0,7,1],[7,6,7,7],[7,8,7,9],[7,10,7,11],[7,12,7,13],[6,0,6,1],[6,6,6,7],[6,8,6,9],[6,10,6,11],[6,12,6,13],[8,1,8,11],[9,0,19,0],[9,1,9,11],[10,1,10,11],[11,1,11,11],[12,1,12,11],[13,1,13,11],[14,1,14,11],[15,1,15,11],[16,1,16,11],[17,1,17,11],[18,1,18,11],[19,1,19,11],[20,1,20,11],[21,0,30,0],[21,1,21,11],[22,1,22,11],[23,1,23,11],[24,1,24,11],[25,1,25,11],[26,1,26,11],[27,1,27,11],[28,1,28,11],[29,1,29,11],[30,1,30,11],[35,1,35,11],[36,1,36,11],[37,0,40,0],[37,1,37,11],[38,1,38,11],[39,1,39,11],[40,1,40,11],[31,0,36,0],[31,1,31,11],[32,1,32,11],[33,1,33,11],[34,1,34,11],[41,0,43,0],[41,1,43,13],[44,0,44,13],[46,7,46,8],[46,12,47,12],[47,0,48,3],[47,7,47,8]]}
["【 群 馬 県 ： 施 工 状 況 把 握 チ ェ ッ ク シ ー ト（ コ ン ク リ ー ト 打 込 み 時）】"]
[]
["事務所名",null,{"$f":"IF(COUNTBLANK(シート①!D4)>0,\"\",シート①!D4)","v":"前橋土木事務所"},null,null,null,"工事名",null,{"$f":"IF(COUNTBLANK(シート①!D6)>0,\"\",シート①!D6)","v":"○○○工事"},null,null,null,"工区",{"$f":"IF(COUNTBLANK(シート①!N6)>0,\"\",シート①!N6)","v":2}]
["構造物名",null,{"$f":"IF(COUNTBLANK(シート①!D8)>0,\"\",シート①!D8)","v":"○○橋"},null,null,null,"部位",null,{"$f":"IF(COUNTBLANK(シート①!D9)>0,\"\",シート①!D9)","v":"A1橋台"},null,null,null,"リフト",{"$f":"IF(COUNTBLANK(シート①!K9)>0,\"\",シート①!K9)","v":"第2リフト"}]
["受注者",null,null,null,null,null,"確認者"]
["配合",null,null,null,null,null,"確認日時"]
["打込み開始時刻",null,"予定",null,"実績",null,"打込み開始時気温",null,null,null,"天候"]
["打込み終了時刻",null,"予定",null,"実績",null,"打込み量(m3)",null,null,null,"リフト高(m)"]
["施工\n段階","チェック項目",null,null,null,null,null,null,null,null,null,null,"記述","確認"]
["準備","コンクリート打込み作業人員（※）に余裕を持たせているか。"]
[null,"予備のバイブレータを準備しているか。"]
[null,"発電機のトラブルがないよう、事前にチェックをしているか。",null,null,null,null,null,null,null,null,null,null,"－"]
[null,"急な雨に対応出来るように、シート等は用意されているか。",null,null,null,null,null,null,null,null,null,null,"－"]
[null,"運搬装置・打込み設備は汚れていないか。",null,null,null,null,null,null,null,null,null,null,"－"]
[null,"足洗い場が設置されているか。",null,null,null,null,null,null,null,null,null,null,"－"]
[null,"型枠内部に、木屑や結束線等の異物はないか。",null,null,null,null,null,null,null,null,null,null,"－"]
[null,"かぶり内に結束線はないか。",null,null,null,null,null,null,null,null,null,null,"－"]
[null,"硬化したコンクリートの表面のレイタンス等は取り除き、ぬらしているか。",null,null,null,null,null,null,null,null,null,null,"－"]
[null,"型枠面は湿らせているか。",null,null,null,null,null,null,null,null,null,null,"－"]
[null,"ポンプ車のアウトリガーの張出及び敷板養生は十分か。",null,null,null,null,null,null,null,null,null,null,"－"]
["運搬","練り混ぜてから打ち終わるまでの時間は適切であるか。"]
["打込み","ポンプや配管内面の潤滑性を確保するため、先送りモルタルの圧送等の処置を施しているか。",null,null,null,null,null,null,null,null,null,null,"－"]
[null,"鉄筋や型枠は乱れていないか。",null,null,null,null,null,null,null,null,null,null,"－"]
[null,"横移動が不要となる適切な位置に、コンクリートを垂直に降ろしているか。",null,null,null,null,null,null,null,null,null,null,"－"]
[null,"コンクリートは、打込みが完了するまで連続して打ち込んでいるか。",null,null,null,null,null,null,null,null,null,null,"－"]
[null,"コンクリートの表面が水平になるように打ち込んでいるか。",null,null,null,null,null,null,null,null,null,null,"－"]
[null,"一層の高さは、50cm以下としているか。"]
[null,"2層以上に分けて打ち込む場合は、上層のコンクリートの打込みは、下層のコンクリートが固まり始める前に行っているか。",null,null,null,null,null,null,null,null,null,null,"－"]
[null,"ポンプ配管等の吐出口から打込み面までの高さは、1.5m以下としているか。"]
[null,"表面にブリーディング水がある場合には、これを取り除いてからコンクリートを打ち込んでいるか。",null,null,null,null,null,null,null,null,null,null,"－"]
[null,"鉄筋にコンクリートが付着した場合には、これを取り除いてから次のコンクリートを打ち込んでいるか。",null,null,null,null,null,null,null,null,null,null,"－"]
["締固め","バイブレータを下層のコンクリートに10cm程度挿入しているか。",null,null,null,null,null,null,null,null,null,null,"－"]
[null,"バイブレータを鉛直に挿入し、挿入間隔は50cm以下としているか。",null,null,null,null,null,null,null,null,null,null,"－"]
[null,"締固め作業中に、バイブレータを鉄筋等に接触させていないか。",null,null,null,null,null,null,null,null,null,null,"－"]
[null,"バイブレータでコンクリートを横移動させていないか。",null,null,null,null,null,null,null,null,null,null,"－"]
[null,"バイブレータは、穴が残らないように徐々に引き抜いているか。",null,null,null,null,null,null,null,null,null,null,"－"]
[null,"締固め時間は適切か（５～15秒）"]
["養生","硬化を始めるまでに乾燥するおそれがある場合は、シートなどで日よけや風よけを設けているか。",null,null,null,null,null,null,null,null,null,null,"－"]
[null,"コンクリートの露出面を湿潤状態に保っているか。",null,null,null,null,null,null,null,null,null,null,"－"]
[null,"湿潤状態を保つ期間は適切であるか。"]
[null,"型枠および支保工の取外しは、コンクリートが必要な強度に達した後であるか。",null,null,null,null,null,null,null,null,null,null,"－"]
["要改善\n事項等"]
[]
[]
["※打込み作業人員：コンクリートの打込み・締固め作業時の人員のうち、直接作業に携わらない者（監理・主任技術者やポンプ車運転手）を除いた人員\n※※本シートは、山口県のチェックシートをもとに群馬県品質確保WGが作成した暫定版である。"]
[]
[null,null,null,null,null,null,"所長","副所長",null,"係長",null,null,"報告者(監督員)"]
["事務所でとりまとめ\n写しを建設企画課に\n提出",null,null,null,null,null,null,"次長(技)"]

{"sheet":"目視評価記録シート","index":10,"n_rows":33,"n_cols":7,"rows_kept":33,"cut":false,"hidden":false,"merged":[[0,0,0,8],[3,1,3,3],[3,5,3,6],[4,1,4,6],[5,0,5,1],[5,2,5,4],[30,0,30,6],[33,0,42,6],[29,0,29,6],[7,0,7,2],[8,0,8,2],[10,0,10,2],[7,3,7,6],[8,3,8,6],[10,3,10,6],[9,0,9,2],[9,3,9,6]]}
["目視評価記録シート　Ver.01"]
[]
["基本情報","※シート①より自動転載"]
["工事名",{"$f":"IF(COUNTBLANK(シート①!D6)>0,\"\",シート①!D6)","v":"○○○工事"},null,null,"工区",{"$f":"IF(COUNTBLANK(シート①!N6)>0,\"\",シート①!N6)","v":2}]
["構造物名",{"$f":"IF(COUNTBLANK(シート①!D8)>0,\"\",シート①!D8)","v":"○○橋"}]
["構造物詳細",null,{"$f":"IF(COUNTBLANK(シート①!D9)>0,\"\",シート①!D9)","v":"A1橋台"},null,null,"リフト名",{"$f":"IF(COUNTBLANK(シート①!K9)>0,\"\",シート①!K9)","v":"第2リフト"}]
[]
["目視評価対象リフトの打込み日"]
["目視評価実施日"]
["目視評価実施時の材齢（日）　※自動計算",null,null,{"$f":"D9-D8","v":0}]
["目視評価実施日の天候"]
[]
["番号","評価者","沈みひび割れ","表面気泡","打重ね線","ノロ漏れ","砂すじ"]
[1]
[2]
[3]
[4]
[5]
[6]
[7]
[8]
[9]
[10]
[11]
[12]
[13]
[14]
[15]
["平均値",{"$f":"AVERAGE(C29:G29)","v":0},{"$f":"IFERROR(AVERAGE(C14:C28),0)","v":0},0,0,0,{"$f":"IFERROR(AVERAGE(G14:G28),0)","v":0}]
["※別添の目視評価参考資料をもとに評価者の点数を記録"]
["※評価者については氏名でも「監督職員A」などの記号でも可．"]
[]
["備考（目視評価実施中の気付きを記入）"]

{"sheet":"シートA　打設予定報告","index":11,"n_rows":20,"n_cols":12,"rows_kept":20,"cut":false,"hidden":false,"merged":[[4,2,13,2],[4,4,13,4],[1,11,2,11],[19,1,19,11],[1,0,2,0],[1,1,2,1],[1,2,2,2],[1,3,2,3],[1,4,1,6],[1,7,1,10]]}
[null,null,null,null,null,null,null,null,null,null,null,"別表１"]
["番号","事務所","路河川","箇所","構造物",null,null,"規格（概略寸法）"]
[null,null,null,null,"構造","（その他の場合の構造）","ＲＣ　or　ＰＣ","体積(ｍ3)","長さ（ｍ）","幅（ｍ）","高さ（ｍ）"]
[]
[null,null,"打込み日\n（予定）","１リフト","打込み3ヶ月後\n（予定）","１リフト"]
[]
[null,null,null,"２リフト",null,"２リフト"]
[]
[null,null,null,"３リフト",null,"３リフト"]
[]
[null,null,null,"４リフト",null,"４リフト"]
[]
[null,null,null,"５リフト",null,"５リフト"]
[]
[]
[]
[]
[]
[]
[null,"なお、現場状況により対象構造物、打設時期の変更や監督員が変更となる場合については、建設企画課へ連絡してください。"]

{"sheet":"InputLimitCells","index":12,"n_rows":67,"n_cols":11,"rows_kept":67,"cut":false,"hidden":true,"merged":[]}
["InputLimitCells(データ入力制限設定記録)"]
["通番","シート名","列","行","表題",null,"制限","Format",null,"メッセージまたは備考"]
[{"$f":"IF(\"\"<>B3,ROW()-2,\"\")","v":1},"シート①","K",5,"工期","開始","日付","YYYY/MM/DD","半角","入力値エラー","YYYY/MM/DD形式で、1904/1/1以降の日付を入力してください。"]
[{"$f":"IF(\"\"<>B4,ROW()-2,\"\")","v":2},"シート①","N",5,"工期","終了","日付","YYYY/MM/DD","半角","入力値エラー","YYYY/MM/DD形式で、1904/1/1以降の日付を入力してください。"]
[{"$f":"IF(\"\"<>B5,ROW()-2,\"\")","v":3},"シート①","F",37,"厚さ",null,"小数0以上","*.###","半角文字列"]
[4,"シート①","L",37,"誘発目地間隔",null,"小数0以上",null,"半角文字列"]
[5,"シート①","F",38,"長さ(幅)",null,"小数0以上","*.##","半角文字列"]
[6,"シート①","L",38,"膨張材",null,"小数0以上",null,"半角文字列"]
[7,"シート②","I",10,"スランプ",null,"整数",null,"数値","入力値エラー","正の整数を入力してください。"]
[8,"シート②","M",10,"骨材最大寸法",null,"整数",null,"数値","入力値エラー","正の整数を入力してください。"]
[9,"シート②","E",11,"水セメント比",null,"整数",null,"数値","入力値エラー","正の整数を入力してください。"]
[10,"シート②","I",11,"単位ｾﾒﾝﾄ量",null,"整数",null,"数値","入力値エラー","正の整数を入力してください。"]
[11,"シート②","E",16,"打込み開始時","スランプ","小数0以上","*.#","半角文字列"]
[12,"シート②","E",17,"打込み開始時","空気量","小数0以上","*.#","半角文字列"]
[13,"シート②","E",18,"打込み開始時","塩化物イオン量","小数0以上","*.#","半角文字列"]
[14,"シート②","N",18,"試験許容値","塩化物イオン量","小数0以上","*.##","半角文字列"]
[15,"シート②","E",19,"打込み開始時","ｺﾝｸﾘｰﾄ温度","小数0以上","*.#","半角文字列"]
[16,"シート②","E",20,"打込み開始時","打込み時外気温","小数0以上","*.#","半角文字列"]
[17,"シート②","E",21,"打込み開始時","7日強度","小数0以上","*.#","半角文字列"]
[18,"シート②","E",22,"打込み開始時","28日強度","小数0以上","*.#","半角文字列"]
[19,"シート②","D",25,"打込み日",null,"日付","YYYY/MM/DD","半角","入力値エラー","YYYY/MM/DD形式で、1904/1/1以降の日付を入力してください。"]
[20,"シート②","N",25,"下側ﾘﾌﾄ打込み日",null,"日付","YYYY/MM/DD","半角","入力値エラー","YYYY/MM/DD形式で、1904/1/1以降の日付を入力してください。"]
[{"$f":"IF(\"\"<>B23,ROW()-2,\"\")","v":21},"シート②","F",27,"運搬","現場までの運搬時間","整数",null,"数値","入力値エラー","正の整数を入力してください。"]
[22,"シート②","J",27,"運搬","現場待機時間","整数",null,"数値","入力値エラー","正の整数を入力してください。"]
[23,"シート②","N",27,"運搬","荷卸し時間","整数",null,"数値","入力値エラー","正の整数を入力してください。"]
[24,"シート②","J",28,"運搬","ポンプ圧送距離","整数",null,"数値","入力値エラー","正の整数を入力してください。"]
[25,"シート②","N",28,"運搬","ポンプ車台数","整数",null,"数値","入力値エラー","正の整数を入力してください。"]
[26,"シート②","F",29,"開始時刻",null,"時刻","hh:mm","半角","入力値エラー","0:00～23:59で入力してください。"]
[27,"シート②","J",29,"終了時刻",null,"時刻","hh:mm","半角","入力値エラー","0:00～23:59で入力してください。"]
[28,"シート②","F",31,"打込み","リフト高","小数0以上","*.#","半角文字列"]
[29,"シート②","J",31,"打込み","打込み量","小数0以上","*.#","半角文字列"]
[30,"シート②","N",31,"打込み","打込み速度","小数0以上","*.#","半角文字列"]
[31,"シート②","F",31,"締固め","ﾊﾞｲﾌﾞﾚｰﾀ台数","整数",null,"数値","入力値エラー","正の整数を入力してください。"]
[32,"シート②","J",31,"締固め","ﾊﾞｲﾌﾞﾚｰﾀ人数","整数",null,"数値","入力値エラー","正の整数を入力してください。"]
[33,"シート②","N",31,"締固め","ﾊﾞｲﾌﾞﾚｰﾀ予備","整数",null,"数値","入力値エラー","正の整数を入力してください。"]
[34,"シート②","F",32,"締固め","ホース筒先","整数",null,"数値","入力値エラー","正の整数を入力してください。"]
[35,"シート②","D",35,"初期温度",null,"小数1000000以下","*.#","半角文字列"]
[36,"シート②","H",35,"最高温度",null,"小数1000000以下","*.#","半角文字列"]
[37,"シート②","F",36,"最高温度に到達した時間",null,"整数",null,"数値","入力値エラー","正の整数を入力してください。"]
[38,"シート②","F",39,"脱型日",null,"日付","YYYY/MM/DD","半角","入力値エラー","YYYY/MM/DD形式で、1904/1/1以降の日付を入力してください。"]
[39,"シート②","F",42,"養生（湿潤状態）期間",null,"整数",null,"数値","入力値エラー","正の整数を入力してください。"]
[40,"シート③④","F",null,"計測時刻",null,"時刻","hh:mm","半角","入力値エラー","0:00～23:59で入力してください。"]
[41,"シート③④","G",null,"ｺﾝｸﾘｰﾄ温度",null,"小数1000000以下","*.#","半角文字列"]
[42,"シート③④","I",null,"外気温",null,"小数1000000以下","*.#","半角文字列"]
[{"$f":"IF(\"\"<>B45,ROW()-2,\"\")","v":43},"シート⑥","C","14～25","調査日",null,"日付","YYYY/MM/DD","半角","入力値エラー","YYYY/MM/DD形式で、1904/1/1以降の日付を入力してください。"]
[44,"シート⑥","E～O",29,"補修日",null,"日付","YYYY/MM/DD","半角","入力値エラー","YYYY/MM/DD形式で、1904/1/1以降の日付を入力してください。"]
[""]
[""]
[""]
[""]
[""]
[""]
[""]
[""]
[""]
[""]
[""]
[""]
[""]
[""]
[""]
[""]
[""]
[""]
[""]
[""]
[""]

{"sheet":"List_DEF","index":13,"n_rows":37,"n_cols":34,"rows_kept":37,"cut":false,"hidden":true,"merged":[]}
["使用","シート①","シート①","シート①","シート①","シート①","シート①","シート①","シート①","シート①","シート①","シート②","シート②","シート②","シート②","シート②","シート⑥ (追加あり)","シート⑥ (追加あり)","シート⑥ (追加あり)","シート⑤","シート⑥ (追加あり)","シート⑦","シート⑦","シート⑦","シート⑦","シート⑦","シート⑦","シート⑧","CheckList","CheckList","CheckList","CheckList","CheckList","シート①"]
["位置","L34","L36","F40/F41/F42/F43","M34","M36","G40/G41/G42/G43","F33","F34","F35","L33","E10","E12","E13","I13","F28","E/O11","E/O12","E/O13","E10","E/O28","J14",null,null,null,null,null,null,"B/J","K","Ｎ","M","Q","K4"]
["表題","○ひび割れ抑制対策","○ひび割れ抑制対策","○配筋","○ひび割れ抑制対策","○ひび割れ抑制対策","○配筋","○構造","○構造","○構造","○ひび割れ抑制対策","○コンクリート","○コンクリート","○コンクリート","○コンクリート","○運搬・打込み・締固め","○ひび割れ状況","○ひび割れ状況","○ひび割れ状況","○ひび割れの有無","○ひび割れ状況","○確実な施工","○確実な施工","○確実な施工","○確実な施工","○ひび割れ抑制","○ひび割れ抑制","○排水・防水対策","チェック有効",null,null,"Form","Relation","○基本情報"]
[null,null,null,null,null,null,null,null,null,null,null,null,null,null,null,null,"ひび割れ","ひび割れ","ひび割れ",null,"補修",null,null,null,null,null,null,null,"Effective","Half-width Kind","Range","Format","Kind"]
[null,"配筋状況（タイプA）","配筋状況（タイプB）","配筋面1","配筋状況（タイプA）","配筋状況（タイプB）","配筋面2","構造物種類","構造形式","打込み部位","補強鉄筋","呼び強度","セメント種類","混和剤","混和材","現場内運搬方法","位置","形状","方向","ひび割れの有無","補修の有無","流動化剤の後添加有無","打込み時の一時鉄筋移動","コンクリートの施工性","初期欠陥の有無/程度","温度ひび割れ検討","照査方法","防水対策の有無",null,null,null,null,null,"受注者"]
["入力","範囲外エラー","範囲外エラー","範囲外エラー","範囲外OK","範囲外OK","範囲外OK","範囲外エラー","範囲外エラー","範囲外エラー","範囲外エラー","範囲外エラー","範囲外エラー","範囲外エラー","範囲外エラー","範囲外エラー","範囲外エラー","範囲外エラー","範囲外エラー","範囲外エラー","範囲外エラー","範囲外エラー","範囲外エラー","範囲外エラー","範囲外エラー","範囲外エラー","範囲外エラー","範囲外エラー","範囲外エラー","範囲外エラー","範囲外エラー","範囲外OK","範囲外エラー","範囲外エラー"]
["規則","半角","半角","半角","半角","半角","半角","コントロールなし","コントロールなし","コントロールなし","コントロールなし","半角","コントロールなし","コントロールなし","コントロールなし","コントロールなし","コントロールなし","コントロールなし","コントロールなし","コントロールなし","コントロールなし","コントロールなし","コントロールなし","コントロールなし","コントロールなし","コントロールなし","コントロールなし","コントロールなし","半角","半角","半角",null,"半角"]
["設定",null,null,null,null,null,null,null,null,null,"空白無視",null,null,"空白無視","空白無視","空白無視","空白無視","空白無視","空白無視","空白無視","空白無視","空白無視","空白無視","空白無視","空白無視","空白無視","空白無視","空白無視","空白無視","空白無視","空白無視","空白無視","空白無視"]
[]
[]
[{"$f":"IF(0<COUNTA(E11:AB11),ROW()-10,\"\")","v":1},null,"同左","同左",null,"同左","同左",null,null,null,"---",null,null,"---","---",null,null,null,null,null,"同左"]
[2,"D13","D13","D13","@125","@125","@125","橋台","RC構造","胸壁","タイプA",21,"高炉B種","AE減水剤","膨張材","ポンプ（配管なし）","正面","貫通","鉛直","有","有","有","有","極めて良好","有","対象","群馬DB","有","Y","A","MT","DATE","R","前橋土木事務所"]
[3,"D16","D16","D16","@150","@150","@150","橋脚","PC構造","たて壁","タイプB",24,"普通","高性能AE","その他","ポンプ（配管あり）","背面","表面","水平","無","無","無","無","良好","無","対象外","山口DB","無",null,"N","AB","TIME","<","渋川土木事務所"]
[4,"D19","D19","D19","@200","@200","@200","ボックスカルバート","無筋構造","柱","タイプA+B",27,"早強","収縮低減剤",null,"クレーン",null,"沈み","その他（斜め、網目等）",null,null,null,null,"普通",null,null,"九州簡易式",null,null,"S",null,"LAT",">","伊勢崎土木事務所"]
[5,"D22","D22","D22","@250","@250","@250","擁壁","その他","側壁・頂版",null,30,"低熱","遅延剤",null,"その他",null,null,null,null,null,null,null,"やや難",null,null,"温度応力解析",null,null,"AN",null,null,"<=","高崎土木事務所"]
[6,"D25","D25","D25","@300","@300","@300","床版",null,"側壁",null,36,"中庸熱","流動化剤",null,null,null,null,null,null,null,null,null,"困難",null,null,"その他",null,null,"AS",null,null,">=","藤岡土木事務所"]
[7,"D29","D29","D29",null,null,null,"高欄",null,"頂版",null,40,"その他","その他",null,null,null,null,null,null,null,null,null,null,null,null,null,null,null,"NS",null,null,"=","富岡土木事務所"]
[8,"D32","D32","D32",null,null,null,"堰堤",null,"底版",null,null,null,null,null,null,null,null,null,null,null,null,null,null,null,null,null,null,null,"ANS",null,null,null,"安中土木事務所"]
[9,"D35","D35","D35",null,null,null,"RC上部工",null,"その他",null,null,null,null,null,null,null,null,null,null,null,null,null,null,null,null,null,null,null,null,null,null,null,"中之条土木事務所"]
[10,"D38","D38","D38",null,null,null,"PC上部工",null,null,null,null,null,null,null,null,null,null,null,null,null,null,null,null,null,null,null,null,null,null,null,null,null,"沼田土木事務所"]
[11,"D41","D41","D41",null,null,null,"その他",null,null,null,null,null,null,null,null,null,null,null,null,null,null,null,null,null,null,null,null,null,null,null,null,null,"太田土木事務所"]
["","D51","D51","D51",null,null,null,null,null,null,null,null,null,null,null,null,null,null,null,null,null,null,null,null,null,null,null,null,null,null,null,null,null,"桐生土木事務所"]
["",null,null,null,null,null,null,null,null,null,null,null,null,null,null,null,null,null,null,null,null,null,null,null,null,null,null,null,null,null,null,null,null,"館林土木事務所"]
["",null,null,null,null,null,null,null,null,null,null,null,null,null,null,null,null,null,null,null,null,null,null,null,null,null,null,null,null,null,null,null,null,"下水道総合事務所"]
[""]
[""]
[""]
[""]
[""]
[""]
[""]
[""]
[""]
[""]
[""]
[""]
[""]

{"sheet":"CheckList","index":14,"n_rows":739,"n_cols":28,"rows_kept":739,"cut":false,"hidden":true,"merged":[]}
[null,"チェック有効","チェック対象セル",null,null,null,null,null,null,"チェック種別",null,"Length","Form","Num Range",null,null,"Relation",null,null,null,null,null,null,null,"DB",null,null,"EfctValNum"]
["No.","Effective","Sheet","列","行","BeforeVal","NowVal","EfctVal","Differ","Required","Half-width Kind","CharNum","Format","Range","Min","Max","Kind","1 No","2 No","3 No","4 No","5 No","Efct Chk","Posit Chk","Register","RegisterVal","Column",{"$f":"(MATCH(\"_e\",$H:$H,0)-3)-COUNTBLANK($H$3:INDIRECT(\"$H\"&TEXT(MATCH(\"_e\",$H:$H,0)-1,\"@\")))","v":297}]
[{"$f":"IF($C3=\"\",\"\",ROW()-2)","v":1},"Y","シート①","D",4,null,{"$f":"IFERROR(IF(ISBLANK(INDIRECT($C3 & \"!\" & $D3 & $E3)),\"\",INDIRECT($C3 & \"!\" & $D3 & $E3)),\"\")","v":"前橋土木事務所"},{"$f":"IF(AND($B3<>\"\",$G3<>\"\"),$G3,\"\")","v":"前橋土木事務所"},{"$f":"IF($F3<>$H3,\"D\",\"\")","v":"D"},"Y",null,30,null,null,null,null,null,null,null,null,null,null,{"$f":"IF(AND($B3=\"\",0<COUNTA($J3:$V3)),\"?\",\"\")","v":""},{"$f":"IF(AND($B3<>\"\",OR($C3=\"\",$D3=\"\",$E3=\"\")),\"?\",\"\")","v":""},"Y",{"$f":"IF(AND($H3<>\"\",$Y3<>\"\"),$H3,\"\")","v":"前橋土木事務所"},"organization_jname"]
[{"$f":"IF($C4=\"\",\"\",MAX($A$3:INDIRECT(\"A\" & TEXT(ROW()-1,\"@\")))+1)","v":2},"Y","シート①","K",4,null,{"$f":"IFERROR(IF(ISBLANK(INDIRECT($C4 & \"!\" & $D4 & $E4)),\"\",INDIRECT($C4 & \"!\" & $D4 & $E4)),\"\")","v":"○○建設（株）"},{"$f":"IF(AND($B4<>\"\",$G4<>\"\"),$G4,\"\")","v":"○○建設（株）"},{"$f":"IF($F4<>$H4,\"D\",\"\")","v":"D"},"Y",null,60,null,null,null,null,null,null,null,null,null,null,{"$f":"IF(AND($B4=\"\",0<COUNTA($J4:$V4)),\"?\",\"\")","v":""},{"$f":"IF(AND($B4<>\"\",OR($C4=\"\",$D4=\"\",$E4=\"\")),\"?\",\"\")","v":""},"Y",{"$f":"IF(AND($H4<>\"\",$Y4<>\"\"),$H4,\"\")","v":"○○建設（株）"},"contractor"]
[{"$f":"IF($C5=\"\",\"\",MAX($A$3:INDIRECT(\"A\" & TEXT(ROW()-1,\"@\")))+1)","v":3},"Y","シート①","D",5,null,"県道○○号　○○橋下部工事","県道○○号　○○橋下部工事","D","Y",null,150,null,null,null,null,null,null,null,null,null,null,{"$f":"IF(AND($B5=\"\",0<COUNTA($J5:$V5)),\"?\",\"\")","v":""},"","Y",{"$f":"IF(AND($H5<>\"\",$Y5<>\"\"),$H5,\"\")","v":"県道○○号　○○橋下部工事"},"route"]
[{"$f":"IF($C6=\"\",\"\",MAX($A$3:INDIRECT(\"A\" & TEXT(ROW()-1,\"@\")))+1)","v":4},"Y","シート①","K",5,null,42826,42826,"D","Y",null,null,"DATE",null,null,null,"<=",{"$f":"A7","v":5},null,null,null,null,"","",null,""]
[{"$f":"IF($C7=\"\",\"\",MAX($A$3:INDIRECT(\"A\" & TEXT(ROW()-1,\"@\")))+1)","v":5},"Y","シート①","N",5,null,43160,43160,"D","Y",null,null,"DATE",null,null,null,null,null,null,null,null,null,"","",null,""]
[{"$f":"IF($C8=\"\",\"\",MAX($A$3:INDIRECT(\"A\" & TEXT(ROW()-1,\"@\")))+1)","v":6},"Y","シート①","D",6,null,"○○○工事","○○○工事","D","Y",null,100,null,null,null,null,null,null,null,null,null,null,"","",null,""]
[{"$f":"IF($C9=\"\",\"\",MAX($A$3:INDIRECT(\"A\" & TEXT(ROW()-1,\"@\")))+1)","v":7},"Y","シート①","N",6,null,2,2,"D",null,null,150,null,null,null,null,null,null,null,null,null,null,"","","Y",2,"section"]
[{"$f":"IF($C10=\"\",\"\",MAX($A$3:INDIRECT(\"A\" & TEXT(ROW()-1,\"@\")))+1)","v":8},"Y","シート①","D",7,null,"○○市○○地内","○○市○○地内","D","Y",null,150,null,null,null,null,null,null,null,null,null,null,"","","Y","○○市○○地内","cons_location"]
[{"$f":"IF($C11=\"\",\"\",MAX($A$3:INDIRECT(\"A\" & TEXT(ROW()-1,\"@\")))+1)","v":9},"Y","シート①","K",7,null,"36°55′15″","36°55′15″","D","Y",null,null,"LAT","AB",null,null,null,null,null,null,null,null,"","","Y","36°55′15″","cons_latitude"]
[{"$f":"IF($C12=\"\",\"\",MAX($A$3:INDIRECT(\"A\" & TEXT(ROW()-1,\"@\")))+1)","v":10},"Y","シート①","N",7,null,"122°56′1″","122°56′1″","D","Y",null,null,"LAT","AB",null,null,null,null,null,null,null,null,"","","Y","122°56′1″","cons_longitude"]
[{"$f":"IF($C13=\"\",\"\",MAX($A$3:INDIRECT(\"A\" & TEXT(ROW()-1,\"@\")))+1)","v":11},"Y","シート①","D",8,null,"○○橋","○○橋","D","Y",null,150,null,null,null,null,null,null,null,null,null,null,"","","Y","○○橋","structure_name"]
[{"$f":"IF($C14=\"\",\"\",MAX($A$3:INDIRECT(\"A\" & TEXT(ROW()-1,\"@\")))+1)","v":12},"Y","シート①","D",9,null,"A1橋台","A1橋台","D","Y",null,150,null,null,null,null,null,null,null,null,null,null,"","","Y","A1橋台","structure_concrete"]
[{"$f":"IF($C15=\"\",\"\",MAX($A$3:INDIRECT(\"A\" & TEXT(ROW()-1,\"@\")))+1)","v":13},"Y","シート①","K",9,null,"第2リフト","第2リフト","D","Y",null,50,null,null,null,null,null,null,null,null,null,null,"","",null,""]
[{"$f":"IF($C16=\"\",\"\",MAX($A$3:INDIRECT(\"A\" & TEXT(ROW()-1,\"@\")))+1)","v":14},"Y","シート①","F",33,null,"橋台","橋台","D","Y",null,20,null,null,null,null,null,null,null,null,null,null,"","","Y","橋台","structure_type"]
[{"$f":"IF($C17=\"\",\"\",MAX($A$3:INDIRECT(\"A\" & TEXT(ROW()-1,\"@\")))+1)","v":15},"Y","シート①","F",34,null,"RC構造","RC構造","D","Y",null,20,null,null,null,null,null,null,null,null,null,null,"","","Y","RC構造","structure_form"]
[{"$f":"IF($C18=\"\",\"\",MAX($A$3:INDIRECT(\"A\" & TEXT(ROW()-1,\"@\")))+1)","v":16},"Y","シート①","F",35,null,"たて壁","たて壁","D","Y",null,20,null,null,null,null,null,null,null,null,null,null,"","","Y","たて壁","placing_place"]
[{"$f":"IF($C19=\"\",\"\",MAX($A$3:INDIRECT(\"A\" & TEXT(ROW()-1,\"@\")))+1)","v":17},"Y","シート①","F",37,null,2.2000000000000002,2.2000000000000002,"D","Y","N",null,null,"AB",0,1000,null,null,null,null,null,null,"","","Y",2.2000000000000002,"structure_height"]
[{"$f":"IF($C20=\"\",\"\",MAX($A$3:INDIRECT(\"A\" & TEXT(ROW()-1,\"@\")))+1)","v":18},"Y","シート①","F",38,null,10.1,10.1,"D","Y","N",null,null,"AB",0,1000,null,null,null,null,null,null,"","","Y",10.1,"structure_width"]
[{"$f":"IF($C21=\"\",\"\",MAX($A$3:INDIRECT(\"A\" & TEXT(ROW()-1,\"@\")))+1)","v":19},"Y","シート①","F",40,null,"D29","D29","D","Y","AN",null,null,null,null,null,null,null,null,null,null,null,"","",null,""]
[{"$f":"IF($C22=\"\",\"\",MAX($A$3:INDIRECT(\"A\" & TEXT(ROW()-1,\"@\")))+1)","v":20},"Y","シート①","G",40,null,"@125","@125","D","Y","NS",null,null,null,null,null,null,null,null,null,null,null,"","",null,""]
[{"$f":"IF($C23=\"\",\"\",MAX($A$3:INDIRECT(\"A\" & TEXT(ROW()-1,\"@\")))+1)","v":21},"Y","シート①","F",41,null,"D29","D29","D","Y","AN",null,null,null,null,null,null,null,null,null,null,null,"","",null,""]
[{"$f":"IF($C24=\"\",\"\",MAX($A$3:INDIRECT(\"A\" & TEXT(ROW()-1,\"@\")))+1)","v":22},"Y","シート①","G",41,null,"@125","@125","D","Y","NS",null,null,null,null,null,null,null,null,null,null,null,"","",null,""]
[{"$f":"IF($C25=\"\",\"\",MAX($A$3:INDIRECT(\"A\" & TEXT(ROW()-1,\"@\")))+1)","v":23},"Y","シート①","F",42,null,"D19","D19","D","Y","AN",null,null,null,null,null,null,null,null,null,null,null,"","",null,""]
[{"$f":"IF($C26=\"\",\"\",MAX($A$3:INDIRECT(\"A\" & TEXT(ROW()-1,\"@\")))+1)","v":24},"Y","シート①","G",42,null,"@125","@125","D","Y","NS",null,null,null,null,null,null,null,null,null,null,null,"","",null,""]
[{"$f":"IF($C27=\"\",\"\",MAX($A$3:INDIRECT(\"A\" & TEXT(ROW()-1,\"@\")))+1)","v":25},"Y","シート①","F",43,null,"D19","D19","D","Y","AN",null,null,null,null,null,null,null,null,null,null,null,"","",null,""]
[{"$f":"IF($C28=\"\",\"\",MAX($A$3:INDIRECT(\"A\" & TEXT(ROW()-1,\"@\")))+1)","v":26},"Y","シート①","G",43,null,"@125","@125","D","Y","NS",null,null,null,null,null,null,null,null,null,null,null,"","",null,""]
[{"$f":"IF($C29=\"\",\"\",MAX($A$3:INDIRECT(\"A\" & TEXT(ROW()-1,\"@\")))+1)","v":27},"Y","シート①","L",33,null,"タイプA","タイプA","D",null,null,null,null,null,null,null,"R",{"$f":"A30","v":28},{"$f":"A31","v":29},{"$f":"A32","v":30},{"$f":"A33","v":31},{"$f":"A34","v":32},"","",null,""]
[{"$f":"IF($C30=\"\",\"\",MAX($A$3:INDIRECT(\"A\" & TEXT(ROW()-1,\"@\")))+1)","v":28},"Y","シート①","L",34,null,"D19","D19","D",null,"AN",null,null,null,null,null,null,{"$f":"A31","v":29},{"$f":"A32","v":30},null,null,null,"","",null,""]
[{"$f":"IF($C31=\"\",\"\",MAX($A$3:INDIRECT(\"A\" & TEXT(ROW()-1,\"@\")))+1)","v":29},"Y","シート①","M",34,null,"@125","@125","D",null,"NS",null,null,null,null,null,null,null,null,null,null,null,"","",null,""]
[{"$f":"IF($C32=\"\",\"\",MAX($A$3:INDIRECT(\"A\" & TEXT(ROW()-1,\"@\")))+1)","v":30},"Y","シート①","L",35,null,"1","1","D",null,"N",null,null,"AB",0,100,null,null,null,null,null,null,"","",null,""]
[{"$f":"IF($C33=\"\",\"\",MAX($A$3:INDIRECT(\"A\" & TEXT(ROW()-1,\"@\")))+1)","v":31},"Y","シート①","L",36,null,"","","",null,"AN",null,null,null,null,null,null,null,null,null,null,null,"","",null,""]
[{"$f":"IF($C34=\"\",\"\",MAX($A$3:INDIRECT(\"A\" & TEXT(ROW()-1,\"@\")))+1)","v":32},"Y","シート①","M",36,null,"","","",null,"NS",null,null,null,null,null,null,null,null,null,null,null,"","",null,""]
[{"$f":"IF($C35=\"\",\"\",MAX($A$3:INDIRECT(\"A\" & TEXT(ROW()-1,\"@\")))+1)","v":33},"Y","シート①","F",44,null,"40mm","40mm","D",null,null,14,null,null,null,null,null,null,null,null,null,null,"","",null,""]
[{"$f":"IF($C36=\"\",\"\",MAX($A$3:INDIRECT(\"A\" & TEXT(ROW()-1,\"@\")))+1)","v":34},"Y","シート①","D",45,null,"","","",null,null,150,null,null,null,null,null,null,null,null,null,null,"","",null,""]
[{"$f":"IF($C37=\"\",\"\",MAX($A$3:INDIRECT(\"A\" & TEXT(ROW()-1,\"@\")))+1)","v":35},"Y","シート①","L",37,null,"","","",null,"N",null,null,"AB",0,1000,null,null,null,null,null,null,"","","Y","","joint_interval"]
[{"$f":"IF($C38=\"\",\"\",MAX($A$3:INDIRECT(\"A\" & TEXT(ROW()-1,\"@\")))+1)","v":36},"Y","シート①","L",38,null,"","","",null,"N",null,null,"AB",0,1000,null,null,null,null,null,null,"","",null,""]
[{"$f":"IF($C39=\"\",\"\",MAX($A$3:INDIRECT(\"A\" & TEXT(ROW()-1,\"@\")))+1)","v":37},"Y","シート①","L",39,null,"","","",null,null,24,null,null,null,null,null,null,null,null,null,null,"","",null,""]
[{"$f":"IF($C40=\"\",\"\",MAX($A$3:INDIRECT(\"A\" & TEXT(ROW()-1,\"@\")))+1)","v":38},"Y","シート①","L",42,null,0.11,0.11,"D","Y","N",null,null,"AB",null,1000,null,null,null,null,null,null,"","","Y",0.11,"steel_ratio_before"]
[{"$f":"IF($C41=\"\",\"\",MAX($A$3:INDIRECT(\"A\" & TEXT(ROW()-1,\"@\")))+1)","v":39},"Y","シート①","L",43,null,0.3,0.3,"D",null,"N",null,null,"AB",null,1000,null,null,null,null,null,null,"","","Y",0.3,"steel_ratio_after"]
[{"$f":"IF($C42=\"\",\"\",MAX($A$3:INDIRECT(\"A\" & TEXT(ROW()-1,\"@\")))+1)","v":40},"Y","シート①","L",46,null,"mihon","mihon","D","Y","ANS",30,null,null,null,null,null,null,null,null,null,null,"","","Y","mihon","lift_id"]
[{"$f":"IF($C43=\"\",\"\",MAX($A$3:INDIRECT(\"A\" & TEXT(ROW()-1,\"@\")))+1)","v":41},"Y","シート②","E",10,null,27,27,"D","Y",null,null,null,"AB",null,1000,null,null,null,null,null,null,"","","Y",27,"strength"]
[{"$f":"IF($C44=\"\",\"\",MAX($A$3:INDIRECT(\"A\" & TEXT(ROW()-1,\"@\")))+1)","v":42},"Y","シート②","I",10,null,8,8,"D","Y","N",null,null,"AB",null,1000,null,null,null,null,null,null,"","","Y",8,"slump"]
[{"$f":"IF($C45=\"\",\"\",MAX($A$3:INDIRECT(\"A\" & TEXT(ROW()-1,\"@\")))+1)","v":43},"Y","シート②","M",10,null,20,20,"D","Y","N",null,null,"AB",null,1000,null,null,null,null,null,null,"","","Y",20,"max_aggregate"]
[{"$f":"IF($C46=\"\",\"\",MAX($A$3:INDIRECT(\"A\" & TEXT(ROW()-1,\"@\")))+1)","v":44},"Y","シート②","E",11,null,55,55,"D","Y","N",null,null,"AB",null,1000,null,null,null,null,null,null,"","","Y",55,"wc"]
[{"$f":"IF($C47=\"\",\"\",MAX($A$3:INDIRECT(\"A\" & TEXT(ROW()-1,\"@\")))+1)","v":45},"Y","シート②","I",11,null,300,300,"D","Y","N",null,null,"AB",null,1000,null,null,null,null,null,null,"","","Y",300,"unit_cement"]
[{"$f":"IF($C48=\"\",\"\",MAX($A$3:INDIRECT(\"A\" & TEXT(ROW()-1,\"@\")))+1)","v":46},"Y","シート②","E",12,null,"高炉B種","高炉B種","D","Y",null,60,null,null,null,null,null,null,null,null,null,null,"","","Y","高炉B種","cement_type"]
[{"$f":"IF($C49=\"\",\"\",MAX($A$3:INDIRECT(\"A\" & TEXT(ROW()-1,\"@\")))+1)","v":47},"Y","シート②","I",12,null,"○○セメント（株）","○○セメント（株）","D","Y",null,90,null,null,null,null,null,null,null,null,null,null,"","","Y","○○セメント（株）","cement_company"]
[{"$f":"IF($C50=\"\",\"\",MAX($A$3:INDIRECT(\"A\" & TEXT(ROW()-1,\"@\")))+1)","v":48},"Y","シート②","E",13,null,"AE減水剤","AE減水剤","D",null,null,60,null,null,null,null,null,null,null,null,null,null,"","","Y","AE減水剤","chemical_admixture"]
[{"$f":"IF($C51=\"\",\"\",MAX($A$3:INDIRECT(\"A\" & TEXT(ROW()-1,\"@\")))+1)","v":49},"Y","シート②","I",13,null,"---","---","D",null,null,20,null,null,null,null,null,null,null,null,null,null,"","","Y","---","mineral_admixture"]
[{"$f":"IF($C52=\"\",\"\",MAX($A$3:INDIRECT(\"A\" & TEXT(ROW()-1,\"@\")))+1)","v":50},"Y","シート②","E",14,null,"○○（株）　○○工場","○○（株）　○○工場","D","Y",null,90,null,null,null,null,null,null,null,null,null,null,"","","Y","○○（株）　○○工場","concrete_plant"]
[{"$f":"IF($C53=\"\",\"\",MAX($A$3:INDIRECT(\"A\" & TEXT(ROW()-1,\"@\")))+1)","v":51},"Y","シート②","E",16,null,9,9,"D","Y","N",null,null,"AB",0,1000,null,null,null,null,null,null,"","","Y",9,"slump000"]
[{"$f":"IF($C54=\"\",\"\",MAX($A$3:INDIRECT(\"A\" & TEXT(ROW()-1,\"@\")))+1)","v":52},"Y","シート②","E",17,null,5.5,5.5,"D","Y","N",null,null,"AB",0,1000,null,null,null,null,null,null,"","","Y",5.5,"air_content000"]
[{"$f":"IF($C55=\"\",\"\",MAX($A$3:INDIRECT(\"A\" & TEXT(ROW()-1,\"@\")))+1)","v":53},"Y","シート②","E",18,null,0.03,0.03,"D","Y","N",null,null,"AB",0,1000,null,null,null,null,null,null,"","","Y",0.03,"chloride000"]
[{"$f":"IF($C56=\"\",\"\",MAX($A$3:INDIRECT(\"A\" & TEXT(ROW()-1,\"@\")))+1)","v":54},"Y","シート②","E",19,null,24,24,"D","Y","N",null,null,"AB",0,1000,null,null,null,null,null,null,"","","Y",24,"concrete_temp000"]
[{"$f":"IF($C57=\"\",\"\",MAX($A$3:INDIRECT(\"A\" & TEXT(ROW()-1,\"@\")))+1)","v":55},"Y","シート②","E",20,null,22,22,"D","Y","N",null,null,"AB",0,1000,null,null,null,null,null,null,"","","Y",22,"ambient_temp000"]
[{"$f":"IF($C58=\"\",\"\",MAX($A$3:INDIRECT(\"A\" & TEXT(ROW()-1,\"@\")))+1)","v":56},"Y","シート②","E",21,null,19,19,"D","Y","N",null,null,"AB",0,1000,null,null,null,null,null,null,"","","Y",19,"strength07000"]
[{"$f":"IF($C59=\"\",\"\",MAX($A$3:INDIRECT(\"A\" & TEXT(ROW()-1,\"@\")))+1)","v":57},"Y","シート②","E",22,null,31,31,"D","Y","N",null,null,"AB",0,1000,null,null,null,null,null,null,"","","Y",31,"strength28000"]
[{"$f":"IF($C60=\"\",\"\",MAX($A$3:INDIRECT(\"A\" & TEXT(ROW()-1,\"@\")))+1)","v":58},"Y","シート②","H",16,null,"","","",null,"N",null,null,"AB",0,1000,null,null,null,null,null,null,"","",null,""]
[{"$f":"IF($C61=\"\",\"\",MAX($A$3:INDIRECT(\"A\" & TEXT(ROW()-1,\"@\")))+1)","v":59},"Y","シート②","H",17,null,"","","",null,"N",null,null,"AB",0,1000,null,null,null,null,null,null,"","",null,""]
[{"$f":"IF($C62=\"\",\"\",MAX($A$3:INDIRECT(\"A\" & TEXT(ROW()-1,\"@\")))+1)","v":60},"Y","シート②","H",18,null,"","","",null,"N",null,null,"AB",0,1000,null,null,null,null,null,null,"","",null,""]
[{"$f":"IF($C63=\"\",\"\",MAX($A$3:INDIRECT(\"A\" & TEXT(ROW()-1,\"@\")))+1)","v":61},"Y","シート②","H",19,null,"","","",null,"N",null,null,"AB",0,1000,null,null,null,null,null,null,"","",null,""]
[{"$f":"IF($C64=\"\",\"\",MAX($A$3:INDIRECT(\"A\" & TEXT(ROW()-1,\"@\")))+1)","v":62},"Y","シート②","H",20,null,"","","",null,"N",null,null,"AB",0,1000,null,null,null,null,null,null,"","",null,""]
[{"$f":"IF($C65=\"\",\"\",MAX($A$3:INDIRECT(\"A\" & TEXT(ROW()-1,\"@\")))+1)","v":63},"Y","シート②","H",21,null,"","","",null,"N",null,null,"AB",0,1000,null,null,null,null,null,null,"","",null,""]
[{"$f":"IF($C66=\"\",\"\",MAX($A$3:INDIRECT(\"A\" & TEXT(ROW()-1,\"@\")))+1)","v":64},"Y","シート②","H",22,null,"","","",null,"N",null,null,"AB",0,1000,null,null,null,null,null,null,"","",null,""]
[{"$f":"IF($C67=\"\",\"\",MAX($A$3:INDIRECT(\"A\" & TEXT(ROW()-1,\"@\")))+1)","v":65},"Y","シート②","K",16,null,"","","",null,"N",null,null,"AB",0,1000,null,null,null,null,null,null,{"$f":"IF(AND($B67=\"\",0<COUNTA($J67:$V67)),\"?\",\"\")","v":""},"",null,""]
[{"$f":"IF($C68=\"\",\"\",MAX($A$3:INDIRECT(\"A\" & TEXT(ROW()-1,\"@\")))+1)","v":66},"Y","シート②","K",17,null,{"$f":"IFERROR(IF(ISBLANK(INDIRECT($C68 & \"!\" & $D68 & $E68)),\"\",INDIRECT($C68 & \"!\" & $D68 & $E68)),\"\")","v":""},"",{"$f":"IF($F68<>$H68,\"D\",\"\")","v":""},null,"N",null,null,"AB",0,1000,null,null,null,null,null,null,"",{"$f":"IF(AND($B68<>\"\",OR($C68=\"\",$D68=\"\",$E68=\"\")),\"?\",\"\")","v":""},null,""]
[{"$f":"IF($C69=\"\",\"\",MAX($A$3:INDIRECT(\"A\" & TEXT(ROW()-1,\"@\")))+1)","v":67},"Y","シート②","K",18,null,"","","",null,"N",null,null,"AB",0,1000,null,null,null,null,null,null,"","",null,{"$f":"IF(AND($H69<>\"\",$Y69<>\"\"),$H69,\"\")","v":""}]
[{"$f":"IF($C70=\"\",\"\",MAX($A$3:INDIRECT(\"A\" & TEXT(ROW()-1,\"@\")))+1)","v":68},"Y","シート②","K",19,null,"",{"$f":"IF(AND($B70<>\"\",$G70<>\"\"),$G70,\"\")","v":""},"",null,"N",null,null,"AB",0,1000,null,null,null,null,null,null,"","",null,""]
[{"$f":"IF($C71=\"\",\"\",MAX($A$3:INDIRECT(\"A\" & TEXT(ROW()-1,\"@\")))+1)","v":69},"Y","シート②","K",20,null,"","","",null,"N",null,null,"AB",0,1000,null,null,null,null,null,null,"","",null,""]
[{"$f":"IF($C72=\"\",\"\",MAX($A$3:INDIRECT(\"A\" & TEXT(ROW()-1,\"@\")))+1)","v":70},"Y","シート②","K",21,null,"","","",null,"N",null,null,"AB",0,1000,null,null,null,null,null,null,"","",null,""]
[{"$f":"IF($C73=\"\",\"\",MAX($A$3:INDIRECT(\"A\" & TEXT(ROW()-1,\"@\")))+1)","v":71},"Y","シート②","K",22,null,"","","",null,"N",null,null,"AB",0,1000,null,null,null,null,null,null,"","",null,""]
[{"$f":"IF($C74=\"\",\"\",MAX($A$3:INDIRECT(\"A\" & TEXT(ROW()-1,\"@\")))+1)","v":72},"Y","シート②","N",16,null,"8±2.5cm","8±2.5cm","D",null,null,10,null,null,null,null,null,null,null,null,null,null,"","",null,""]
[{"$f":"IF($C75=\"\",\"\",MAX($A$3:INDIRECT(\"A\" & TEXT(ROW()-1,\"@\")))+1)","v":73},"Y","シート②","N",17,null,"4.5±1.5%","4.5±1.5%","D",null,null,10,null,null,null,null,null,null,null,null,null,null,"","",null,""]
[{"$f":"IF($C76=\"\",\"\",MAX($A$3:INDIRECT(\"A\" & TEXT(ROW()-1,\"@\")))+1)","v":74},"Y","シート②","N",18,null,"0.3","0.3","D",null,"N",null,null,"AB",0,1000,null,null,null,null,null,null,"","",null,""]
[{"$f":"IF($C77=\"\",\"\",MAX($A$3:INDIRECT(\"A\" & TEXT(ROW()-1,\"@\")))+1)","v":75},"Y","シート②","D",25,null,42880,42880,"D","Y",null,null,"DATE",null,null,null,null,null,null,null,null,null,"","","Y","2017-05-25","placing_date"]
[{"$f":"IF($C78=\"\",\"\",MAX($A$3:INDIRECT(\"A\" & TEXT(ROW()-1,\"@\")))+1)","v":76},"Y","シート②","J",25,null,"曇りのち晴","曇りのち晴","D","Y",null,60,null,null,null,null,null,null,null,null,null,null,"","","Y","曇りのち晴","Weather"]
[{"$f":"IF($C79=\"\",\"\",MAX($A$3:INDIRECT(\"A\" & TEXT(ROW()-1,\"@\")))+1)","v":77},"Y","シート②","N",25,null,42865,42865,"D",null,null,null,"DATE",null,null,null,null,null,null,null,null,null,"","",null,""]
[{"$f":"IF($C80=\"\",\"\",MAX($A$3:INDIRECT(\"A\" & TEXT(ROW()-1,\"@\")))+1)","v":78},"Y","シート②","D",26,null,"塗装合板","塗装合板","D","Y",null,30,null,null,null,null,null,null,null,null,null,null,"","",null,""]
[{"$f":"IF($C81=\"\",\"\",MAX($A$3:INDIRECT(\"A\" & TEXT(ROW()-1,\"@\")))+1)","v":79},"Y","シート②","J",26,null,"処理剤（○○）","処理剤（○○）","D",null,null,40,null,null,null,null,null,null,null,null,null,null,"","",null,""]
[{"$f":"IF($C82=\"\",\"\",MAX($A$3:INDIRECT(\"A\" & TEXT(ROW()-1,\"@\")))+1)","v":80},"Y","シート②","F",27,null,20,20,"D","Y","N",null,null,"AB",0,1000,null,null,null,null,null,null,"","","Y",20,"transport_time"]
[{"$f":"IF($C83=\"\",\"\",MAX($A$3:INDIRECT(\"A\" & TEXT(ROW()-1,\"@\")))+1)","v":81},"Y","シート②","J",27,null,0,0,"","Y","N",null,null,"AB",0,1000,null,null,null,null,null,null,"","","Y",0,"waiting_time"]
[{"$f":"IF($C84=\"\",\"\",MAX($A$3:INDIRECT(\"A\" & TEXT(ROW()-1,\"@\")))+1)","v":82},"Y","シート②","N",27,null,20,20,"D","Y","N",null,null,"AB",0,100,null,null,null,null,null,null,"","","Y",20,"placing_time"]
[{"$f":"IF($C85=\"\",\"\",MAX($A$3:INDIRECT(\"A\" & TEXT(ROW()-1,\"@\")))+1)","v":83},"Y","シート②","F",28,null,"ポンプ（配管なし）","ポンプ（配管なし）","D","Y",null,40,null,null,null,null,null,null,null,null,null,null,"","",null,""]
[{"$f":"IF($C86=\"\",\"\",MAX($A$3:INDIRECT(\"A\" & TEXT(ROW()-1,\"@\")))+1)","v":84},"Y","シート②","J",28,null,0,0,"","Y","N",null,null,"AB",0,1000,null,null,null,null,null,null,"","",null,""]
[{"$f":"IF($C87=\"\",\"\",MAX($A$3:INDIRECT(\"A\" & TEXT(ROW()-1,\"@\")))+1)","v":85},"Y","シート②","N",28,null,1,1,"D","Y","N",null,null,"AB",0,100,null,null,null,null,null,null,"","",null,""]
[{"$f":"IF($C88=\"\",\"\",MAX($A$3:INDIRECT(\"A\" & TEXT(ROW()-1,\"@\")))+1)","v":86},"Y","シート②","F",29,null,0.34027777777777773,0.34027777777777773,"D","Y",null,null,"TIME",null,null,null,null,null,null,null,null,null,"","","Y","08:10:00","placing_start"]
[{"$f":"IF($C89=\"\",\"\",MAX($A$3:INDIRECT(\"A\" & TEXT(ROW()-1,\"@\")))+1)","v":87},"Y","シート②","J",29,null,0.45833333333333331,0.45833333333333331,"D","Y",null,null,"TIME",null,null,null,null,null,null,null,null,null,"","","Y","11:00:00","placing_end"]
[{"$f":"IF($C90=\"\",\"\",MAX($A$3:INDIRECT(\"A\" & TEXT(ROW()-1,\"@\")))+1)","v":88},"Y","シート②","F",30,null,3,3,"D","Y","N",null,null,"AB",0,1000,null,null,null,null,null,null,"","","Y",3,"lift_height"]
[{"$f":"IF($C91=\"\",\"\",MAX($A$3:INDIRECT(\"A\" & TEXT(ROW()-1,\"@\")))+1)","v":89},"Y","シート②","J",30,null,70,70,"D","Y","N",null,null,"AB",0,1000,null,null,null,null,null,null,"","","Y",70,"amount"]
[{"$f":"IF($C92=\"\",\"\",MAX($A$3:INDIRECT(\"A\" & TEXT(ROW()-1,\"@\")))+1)","v":90},"Y","シート②","N",30,null,1,1,"D","Y","N",null,null,"AB",0,1000,null,null,null,null,null,null,"","","Y",1,"placing_velocity"]
[{"$f":"IF($C93=\"\",\"\",MAX($A$3:INDIRECT(\"A\" & TEXT(ROW()-1,\"@\")))+1)","v":91},"Y","シート②","F",31,null,3,3,"D","Y","N",null,null,"AB",0,100,null,null,null,null,null,null,"","",null,""]
[{"$f":"IF($C94=\"\",\"\",MAX($A$3:INDIRECT(\"A\" & TEXT(ROW()-1,\"@\")))+1)","v":92},"Y","シート②","J",31,null,4,4,"D","Y","N",null,null,"AB",0,100,null,null,null,null,null,null,"","",null,""]
[{"$f":"IF($C95=\"\",\"\",MAX($A$3:INDIRECT(\"A\" & TEXT(ROW()-1,\"@\")))+1)","v":93},"Y","シート②","N",31,null,1,1,"D","Y","N",null,null,"AB",0,100,null,null,null,null,null,null,"","",null,""]
[{"$f":"IF($C96=\"\",\"\",MAX($A$3:INDIRECT(\"A\" & TEXT(ROW()-1,\"@\")))+1)","v":94},"Y","シート②","F",32,null,1,1,"D","Y","N",null,null,"AB",0,100,null,null,null,null,null,null,"","",null,""]
[{"$f":"IF($C97=\"\",\"\",MAX($A$3:INDIRECT(\"A\" & TEXT(ROW()-1,\"@\")))+1)","v":95},"Y","シート②","D",35,null,24,24,"D",null,"N",null,null,"MT",-273.14999999999998,null,null,null,null,null,null,null,"","","Y",24,"initial_temp"]
[{"$f":"IF($C98=\"\",\"\",MAX($A$3:INDIRECT(\"A\" & TEXT(ROW()-1,\"@\")))+1)","v":96},"Y","シート②","H",35,null,48,48,"D",null,"N",null,null,"MT",-273.14999999999998,null,">",{"$f":"A97","v":95},null,null,null,null,"","","Y",48,"max_temp"]
[{"$f":"IF($C99=\"\",\"\",MAX($A$3:INDIRECT(\"A\" & TEXT(ROW()-1,\"@\")))+1)","v":97},null,"シート②","L",35,null,{"$f":"IFERROR(IF(ISBLANK(INDIRECT($C99 & \"!\" & $D99 & $E99)),\"\",INDIRECT($C99 & \"!\" & $D99 & $E99)),\"\")","v":24},"","",null,"N",null,null,"MT",-273.14999999999998,null,null,null,null,null,null,null,"?","","Y",{"$f":"IF(AND($G99<>\"\",$Y99<>\"\"),$G99,\"\")","v":24},"rise_temp"]
[{"$f":"IF($C100=\"\",\"\",MAX($A$3:INDIRECT(\"A\" & TEXT(ROW()-1,\"@\")))+1)","v":98},"Y","シート②","F",36,null,30,30,"D",null,"N",null,null,"AB",0,100,null,null,null,null,null,null,"","","Y",30,"max_time"]
[{"$f":"IF($C101=\"\",\"\",MAX($A$3:INDIRECT(\"A\" & TEXT(ROW()-1,\"@\")))+1)","v":99},"Y","シート②","F",39,null,42891,42891,"D","Y",null,null,"DATE",null,null,null,">",{"$f":"A77","v":75},null,null,null,null,"","","Y","2017-06-05","removal_day"]
[{"$f":"IF($C102=\"\",\"\",MAX($A$3:INDIRECT(\"A\" & TEXT(ROW()-1,\"@\")))+1)","v":100},null,"シート②","N",39,null,11,"","","Y","N",null,null,"AB",0,1000,null,null,null,null,null,null,{"$f":"IF(AND($B102=\"\",0<COUNTA($J102:$V102)),\"?\",\"\")","v":"?"},"","Y",{"$f":"IF(AND($G102<>\"\",$Y102<>\"\"),$G102,\"\")","v":11},"leaving_period"]
[{"$f":"IF($C103=\"\",\"\",MAX($A$3:INDIRECT(\"A\" & TEXT(ROW()-1,\"@\")))+1)","v":101},"Y","シート②","F",40,null,"型枠＋ブルーシート","型枠＋ブルーシート","D","Y",null,90,null,null,null,null,null,null,null,null,null,null,"","","Y","型枠＋ブルーシート","curing_side"]
[{"$f":"IF($C104=\"\",\"\",MAX($A$3:INDIRECT(\"A\" & TEXT(ROW()-1,\"@\")))+1)","v":102},"Y","シート②","F",41,null,"養生マット＋ブルーシート＋散水","養生マット＋ブルーシート＋散水","D","Y",null,90,null,null,null,null,null,null,null,null,null,null,"","","Y","養生マット＋ブルーシート＋散水","curing_top"]
[{"$f":"IF($C105=\"\",\"\",MAX($A$3:INDIRECT(\"A\" & TEXT(ROW()-1,\"@\")))+1)","v":103},"Y","シート②","F",42,null,7,7,"D","Y","N",null,null,"AB",0,1000,null,null,null,null,null,null,"","","Y",7,"curing_period"]
[{"$f":"IF($C106=\"\",\"\",MAX($A$3:INDIRECT(\"A\" & TEXT(ROW()-1,\"@\")))+1)","v":104},"Y","シート③④","E",10,null,"晴","晴","D",null,null,6,null,null,null,null,null,null,null,null,null,null,"","",null,""]
[{"$f":"IF($C107=\"\",\"\",MAX($A$3:INDIRECT(\"A\" & TEXT(ROW()-1,\"@\")))+1)","v":105},"Y","シート③④","E",11,null,"","","",null,null,6,null,null,null,null,null,null,null,null,null,null,"","",null,""]
[{"$f":"IF($C108=\"\",\"\",MAX($A$3:INDIRECT(\"A\" & TEXT(ROW()-1,\"@\")))+1)","v":106},"Y","シート③④","E",12,null,"","","",null,null,6,null,null,null,null,null,null,null,null,null,null,"","",null,""]
[{"$f":"IF($C109=\"\",\"\",MAX($A$3:INDIRECT(\"A\" & TEXT(ROW()-1,\"@\")))+1)","v":107},"Y","シート③④","E",13,null,"晴","晴","D",null,null,6,null,null,null,null,null,null,null,null,null,null,"","",null,""]
[{"$f":"IF($C110=\"\",\"\",MAX($A$3:INDIRECT(\"A\" & TEXT(ROW()-1,\"@\")))+1)","v":108},"Y","シート③④","E",14,null,"晴","晴","D",null,null,6,null,null,null,null,null,null,null,null,null,null,"","",null,""]
[{"$f":"IF($C111=\"\",\"\",MAX($A$3:INDIRECT(\"A\" & TEXT(ROW()-1,\"@\")))+1)","v":109},"Y","シート③④","E",15,null,"晴","晴","D",null,null,6,null,null,null,null,null,null,null,null,null,null,"","",null,""]
[{"$f":"IF($C112=\"\",\"\",MAX($A$3:INDIRECT(\"A\" & TEXT(ROW()-1,\"@\")))+1)","v":110},"Y","シート③④","E",16,null,"晴","晴","D",null,null,6,null,null,null,null,null,null,null,null,null,null,"","",null,""]
[{"$f":"IF($C113=\"\",\"\",MAX($A$3:INDIRECT(\"A\" & TEXT(ROW()-1,\"@\")))+1)","v":111},"Y","シート③④","E",17,null,"晴","晴","D",null,null,6,null,null,null,null,null,null,null,null,null,null,"","",null,""]
[{"$f":"IF($C114=\"\",\"\",MAX($A$3:INDIRECT(\"A\" & TEXT(ROW()-1,\"@\")))+1)","v":112},"Y","シート③④","E",18,null,"晴","晴","D",null,null,6,null,null,null,null,null,null,null,null,null,null,"","",null,""]
[{"$f":"IF($C115=\"\",\"\",MAX($A$3:INDIRECT(\"A\" & TEXT(ROW()-1,\"@\")))+1)","v":113},"Y","シート③④","E",19,null,"晴","晴","D",null,null,6,null,null,null,null,null,null,null,null,null,null,"","",null,""]
[{"$f":"IF($C116=\"\",\"\",MAX($A$3:INDIRECT(\"A\" & TEXT(ROW()-1,\"@\")))+1)","v":114},"Y","シート③④","E",20,null,"晴","晴","D",null,null,6,null,null,null,null,null,null,null,null,null,null,"","",null,""]
[{"$f":"IF($C117=\"\",\"\",MAX($A$3:INDIRECT(\"A\" & TEXT(ROW()-1,\"@\")))+1)","v":115},"Y","シート③④","E",21,null,"晴","晴","D",null,null,6,null,null,null,null,null,null,null,null,null,null,"","",null,""]
[{"$f":"IF($C118=\"\",\"\",MAX($A$3:INDIRECT(\"A\" & TEXT(ROW()-1,\"@\")))+1)","v":116},"Y","シート③④","E",22,null,"晴","晴","D",null,null,6,null,null,null,null,null,null,null,null,null,null,"","",null,""]
[{"$f":"IF($C119=\"\",\"\",MAX($A$3:INDIRECT(\"A\" & TEXT(ROW()-1,\"@\")))+1)","v":117},"Y","シート③④","E",23,null,"晴","晴","D",null,null,6,null,null,null,null,null,null,null,null,null,null,"","",null,""]
[{"$f":"IF($C120=\"\",\"\",MAX($A$3:INDIRECT(\"A\" & TEXT(ROW()-1,\"@\")))+1)","v":118},"Y","シート③④","E",24,null,"晴","晴","D",null,null,6,null,null,null,null,null,null,null,null,null,null,"","",null,""]
[{"$f":"IF($C121=\"\",\"\",MAX($A$3:INDIRECT(\"A\" & TEXT(ROW()-1,\"@\")))+1)","v":119},"Y","シート③④","E",25,null,"晴","晴","D",null,null,6,null,null,null,null,null,null,null,null,null,null,"","",null,""]
[{"$f":"IF($C122=\"\",\"\",MAX($A$3:INDIRECT(\"A\" & TEXT(ROW()-1,\"@\")))+1)","v":120},"Y","シート③④","E",26,null,"晴","晴","D",null,null,6,null,null,null,null,null,null,null,null,null,null,"","",null,""]
[{"$f":"IF($C123=\"\",\"\",MAX($A$3:INDIRECT(\"A\" & TEXT(ROW()-1,\"@\")))+1)","v":121},"Y","シート③④","E",27,null,"晴","晴","D",null,null,6,null,null,null,null,null,null,null,null,null,null,"","",null,""]
[{"$f":"IF($C124=\"\",\"\",MAX($A$3:INDIRECT(\"A\" & TEXT(ROW()-1,\"@\")))+1)","v":122},"Y","シート③④","E",28,null,"晴","晴","D",null,null,6,null,null,null,null,null,null,null,null,null,null,"","",null,""]
[{"$f":"IF($C125=\"\",\"\",MAX($A$3:INDIRECT(\"A\" & TEXT(ROW()-1,\"@\")))+1)","v":123},"Y","シート③④","E",29,null,"晴","晴","D",null,null,6,null,null,null,null,null,null,null,null,null,null,"","",null,""]
[{"$f":"IF($C126=\"\",\"\",MAX($A$3:INDIRECT(\"A\" & TEXT(ROW()-1,\"@\")))+1)","v":124},"Y","シート③④","E",30,null,"晴","晴","D",null,null,6,null,null,null,null,null,null,null,null,null,null,"","",null,""]
[{"$f":"IF($C127=\"\",\"\",MAX($A$3:INDIRECT(\"A\" & TEXT(ROW()-1,\"@\")))+1)","v":125},"Y","シート③④","E",31,null,"晴","晴","D",null,null,6,null,null,null,null,null,null,null,null,null,null,"","",null,""]
[{"$f":"IF($C128=\"\",\"\",MAX($A$3:INDIRECT(\"A\" & TEXT(ROW()-1,\"@\")))+1)","v":126},"Y","シート③④","E",32,null,"晴","晴","D",null,null,6,null,null,null,null,null,null,null,null,null,null,"","",null,""]
[{"$f":"IF($C129=\"\",\"\",MAX($A$3:INDIRECT(\"A\" & TEXT(ROW()-1,\"@\")))+1)","v":127},"Y","シート③④","E",33,null,"晴","晴","D",null,null,6,null,null,null,null,null,null,null,null,null,null,"","",null,""]
[{"$f":"IF($C130=\"\",\"\",MAX($A$3:INDIRECT(\"A\" & TEXT(ROW()-1,\"@\")))+1)","v":128},"Y","シート③④","E",34,null,"晴","晴","D",null,null,6,null,null,null,null,null,null,null,null,null,null,"","",null,""]
[{"$f":"IF($C131=\"\",\"\",MAX($A$3:INDIRECT(\"A\" & TEXT(ROW()-1,\"@\")))+1)","v":129},"Y","シート③④","E",35,null,"晴","晴","D",null,null,6,null,null,null,null,null,null,null,null,null,null,{"$f":"IF(AND($B131=\"\",0<COUNTA($J131:$V131)),\"?\",\"\")","v":""},"",null,""]
[{"$f":"IF($C132=\"\",\"\",MAX($A$3:INDIRECT(\"A\" & TEXT(ROW()-1,\"@\")))+1)","v":130},"Y","シート③④","E",36,null,{"$f":"IFERROR(IF(ISBLANK(INDIRECT($C132 & \"!\" & $D132 & $E132)),\"\",INDIRECT($C132 & \"!\" & $D132 & $E132)),\"\")","v":"晴"},"晴",{"$f":"IF($F132<>$H132,\"D\",\"\")","v":"D"},null,null,6,null,null,null,null,null,null,null,null,null,null,"",{"$f":"IF(AND($B132<>\"\",OR($C132=\"\",$D132=\"\",$E132=\"\")),\"?\",\"\")","v":""},null,""]
[{"$f":"IF($C133=\"\",\"\",MAX($A$3:INDIRECT(\"A\" & TEXT(ROW()-1,\"@\")))+1)","v":131},"Y","シート③④","E",37,null,"","","",null,null,6,null,null,null,null,null,null,null,null,null,null,"","",null,{"$f":"IF(AND($H133<>\"\",$Y133<>\"\"),$H133,\"\")","v":""}]
[{"$f":"IF($C134=\"\",\"\",MAX($A$3:INDIRECT(\"A\" & TEXT(ROW()-1,\"@\")))+1)","v":132},"Y","シート③④","E",38,null,"",{"$f":"IF(AND($B134<>\"\",$G134<>\"\"),$G134,\"\")","v":""},"",null,null,6,null,null,null,null,null,null,null,null,null,null,"","",null,""]
[{"$f":"IF($C135=\"\",\"\",MAX($A$3:INDIRECT(\"A\" & TEXT(ROW()-1,\"@\")))+1)","v":133},"Y","シート③④","E",39,null,"","","",null,null,6,null,null,null,null,null,null,null,null,null,null,"","",null,""]
[{"$f":"IF($C136=\"\",\"\",MAX($A$3:INDIRECT(\"A\" & TEXT(ROW()-1,\"@\")))+1)","v":134},"Y","シート③④","E",40,null,"","","",null,null,6,null,null,null,null,null,null,null,null,null,null,"","",null,""]
[{"$f":"IF($C137=\"\",\"\",MAX($A$3:INDIRECT(\"A\" & TEXT(ROW()-1,\"@\")))+1)","v":135},"Y","シート③④","E",41,null,"","","",null,null,6,null,null,null,null,null,null,null,null,null,null,"","",null,""]
[{"$f":"IF($C138=\"\",\"\",MAX($A$3:INDIRECT(\"A\" & TEXT(ROW()-1,\"@\")))+1)","v":136},"Y","シート③④","E",42,null,"","","",null,null,6,null,null,null,null,null,null,null,null,null,null,"","",null,""]
[{"$f":"IF($C139=\"\",\"\",MAX($A$3:INDIRECT(\"A\" & TEXT(ROW()-1,\"@\")))+1)","v":137},"Y","シート③④","E",43,null,"晴","晴","D",null,null,6,null,null,null,null,null,null,null,null,null,null,"","",null,""]
[{"$f":"IF($C140=\"\",\"\",MAX($A$3:INDIRECT(\"A\" & TEXT(ROW()-1,\"@\")))+1)","v":138},"Y","シート③④","E",44,null,"晴","晴","D",null,null,6,null,null,null,null,null,null,null,null,null,null,"","",null,""]
[{"$f":"IF($C141=\"\",\"\",MAX($A$3:INDIRECT(\"A\" & TEXT(ROW()-1,\"@\")))+1)","v":139},"Y","シート③④","E",45,null,"晴","晴","D",null,null,6,null,null,null,null,null,null,null,null,null,null,"","",null,""]
[{"$f":"IF($C142=\"\",\"\",MAX($A$3:INDIRECT(\"A\" & TEXT(ROW()-1,\"@\")))+1)","v":140},"Y","シート③④","E",46,null,"晴","晴","D",null,null,6,null,null,null,null,null,null,null,null,null,null,"","",null,""]
[{"$f":"IF($C143=\"\",\"\",MAX($A$3:INDIRECT(\"A\" & TEXT(ROW()-1,\"@\")))+1)","v":141},"Y","シート③④","E",47,null,"晴","晴","D",null,null,6,null,null,null,null,null,null,null,null,null,null,"","",null,""]
[{"$f":"IF($C144=\"\",\"\",MAX($A$3:INDIRECT(\"A\" & TEXT(ROW()-1,\"@\")))+1)","v":142},"Y","シート③④","E",48,null,"晴","晴","D",null,null,6,null,null,null,null,null,null,null,null,null,null,"","",null,""]
[{"$f":"IF($C145=\"\",\"\",MAX($A$3:INDIRECT(\"A\" & TEXT(ROW()-1,\"@\")))+1)","v":143},"Y","シート③④","E",49,null,"晴","晴","D",null,null,6,null,null,null,null,null,null,null,null,null,null,"","",null,""]
[{"$f":"IF($C146=\"\",\"\",MAX($A$3:INDIRECT(\"A\" & TEXT(ROW()-1,\"@\")))+1)","v":144},"Y","シート③④","E",50,null,"晴","晴","D",null,null,6,null,null,null,null,null,null,null,null,null,null,"","",null,""]
[{"$f":"IF($C147=\"\",\"\",MAX($A$3:INDIRECT(\"A\" & TEXT(ROW()-1,\"@\")))+1)","v":145},"Y","シート③④","E",51,null,"晴","晴","D",null,null,6,null,null,null,null,null,null,null,null,null,null,"","",null,""]
[{"$f":"IF($C148=\"\",\"\",MAX($A$3:INDIRECT(\"A\" & TEXT(ROW()-1,\"@\")))+1)","v":146},"Y","シート③④","E",52,null,"晴","晴","D",null,null,6,null,null,null,null,null,null,null,null,null,null,"","",null,""]
[{"$f":"IF($C149=\"\",\"\",MAX($A$3:INDIRECT(\"A\" & TEXT(ROW()-1,\"@\")))+1)","v":147},"Y","シート③④","E",53,null,"晴","晴","D",null,null,6,null,null,null,null,null,null,null,null,null,null,"","",null,""]
[{"$f":"IF($C150=\"\",\"\",MAX($A$3:INDIRECT(\"A\" & TEXT(ROW()-1,\"@\")))+1)","v":148},"Y","シート③④","E",54,null,"晴","晴","D",null,null,6,null,null,null,null,null,null,null,null,null,null,"","",null,""]
[{"$f":"IF($C151=\"\",\"\",MAX($A$3:INDIRECT(\"A\" & TEXT(ROW()-1,\"@\")))+1)","v":149},"Y","シート③④","E",55,null,"晴","晴","D",null,null,6,null,null,null,null,null,null,null,null,null,null,"","",null,""]
[{"$f":"IF($C152=\"\",\"\",MAX($A$3:INDIRECT(\"A\" & TEXT(ROW()-1,\"@\")))+1)","v":150},"Y","シート③④","E",56,null,"晴","晴","D",null,null,6,null,null,null,null,null,null,null,null,null,null,"","",null,""]
[{"$f":"IF($C153=\"\",\"\",MAX($A$3:INDIRECT(\"A\" & TEXT(ROW()-1,\"@\")))+1)","v":151},"Y","シート③④","E",57,null,"晴","晴","D",null,null,6,null,null,null,null,null,null,null,null,null,null,"","",null,""]
[{"$f":"IF($C154=\"\",\"\",MAX($A$3:INDIRECT(\"A\" & TEXT(ROW()-1,\"@\")))+1)","v":152},"Y","シート③④","E",58,null,"晴","晴","D",null,null,6,null,null,null,null,null,null,null,null,null,null,"","",null,""]
[{"$f":"IF($C155=\"\",\"\",MAX($A$3:INDIRECT(\"A\" & TEXT(ROW()-1,\"@\")))+1)","v":153},"Y","シート③④","E",59,null,"晴","晴","D",null,null,6,null,null,null,null,null,null,null,null,null,null,"","",null,""]
[{"$f":"IF($C156=\"\",\"\",MAX($A$3:INDIRECT(\"A\" & TEXT(ROW()-1,\"@\")))+1)","v":154},"Y","シート③④","E",60,null,"晴","晴","D",null,null,6,null,null,null,null,null,null,null,null,null,null,"","",null,""]
[{"$f":"IF($C157=\"\",\"\",MAX($A$3:INDIRECT(\"A\" & TEXT(ROW()-1,\"@\")))+1)","v":155},"Y","シート③④","E",61,null,"","","",null,null,6,null,null,null,null,null,null,null,null,null,null,"","",null,""]
[{"$f":"IF($C158=\"\",\"\",MAX($A$3:INDIRECT(\"A\" & TEXT(ROW()-1,\"@\")))+1)","v":156},"Y","シート③④","E",62,null,"","","",null,null,6,null,null,null,null,null,null,null,null,null,null,"","",null,""]
[{"$f":"IF($C159=\"\",\"\",MAX($A$3:INDIRECT(\"A\" & TEXT(ROW()-1,\"@\")))+1)","v":157},"Y","シート③④","E",63,null,"","","",null,null,6,null,null,null,null,null,null,null,null,null,null,"","",null,""]
[{"$f":"IF($C160=\"\",\"\",MAX($A$3:INDIRECT(\"A\" & TEXT(ROW()-1,\"@\")))+1)","v":158},"Y","シート③④","E",73,null,"晴","晴","D",null,null,6,null,null,null,null,null,null,null,null,null,null,"","",null,""]
[{"$f":"IF($C161=\"\",\"\",MAX($A$3:INDIRECT(\"A\" & TEXT(ROW()-1,\"@\")))+1)","v":159},"Y","シート③④","E",74,null,"","","",null,null,6,null,null,null,null,null,null,null,null,null,null,"","",null,""]
[{"$f":"IF($C162=\"\",\"\",MAX($A$3:INDIRECT(\"A\" & TEXT(ROW()-1,\"@\")))+1)","v":160},"Y","シート③④","E",75,null,"","","",null,null,6,null,null,null,null,null,null,null,null,null,null,"","",null,""]
[{"$f":"IF($C163=\"\",\"\",MAX($A$3:INDIRECT(\"A\" & TEXT(ROW()-1,\"@\")))+1)","v":161},"Y","シート③④","E",76,null,"晴","晴","D",null,null,6,null,null,null,null,null,null,null,null,null,null,"","",null,""]
[{"$f":"IF($C164=\"\",\"\",MAX($A$3:INDIRECT(\"A\" & TEXT(ROW()-1,\"@\")))+1)","v":162},"Y","シート③④","E",77,null,"","","",null,null,6,null,null,null,null,null,null,null,null,null,null,"","",null,""]
[{"$f":"IF($C165=\"\",\"\",MAX($A$3:INDIRECT(\"A\" & TEXT(ROW()-1,\"@\")))+1)","v":163},"Y","シート③④","E",78,null,"","","",null,null,6,null,null,null,null,null,null,null,null,null,null,"","",null,""]
[{"$f":"IF($C166=\"\",\"\",MAX($A$3:INDIRECT(\"A\" & TEXT(ROW()-1,\"@\")))+1)","v":164},"Y","シート③④","E",79,null,"晴","晴","D",null,null,6,null,null,null,null,null,null,null,null,null,null,"","",null,""]
[{"$f":"IF($C167=\"\",\"\",MAX($A$3:INDIRECT(\"A\" & TEXT(ROW()-1,\"@\")))+1)","v":165},"Y","シート③④","E",80,null,"","","",null,null,6,null,null,null,null,null,null,null,null,null,null,"","",null,""]
[{"$f":"IF($C168=\"\",\"\",MAX($A$3:INDIRECT(\"A\" & TEXT(ROW()-1,\"@\")))+1)","v":166},"Y","シート③④","E",81,null,"","","",null,null,6,null,null,null,null,null,null,null,null,null,null,"","",null,""]
[{"$f":"IF($C169=\"\",\"\",MAX($A$3:INDIRECT(\"A\" & TEXT(ROW()-1,\"@\")))+1)","v":167},"Y","シート③④","E",82,null,"晴","晴","D",null,null,6,null,null,null,null,null,null,null,null,null,null,"","",null,""]
[{"$f":"IF($C170=\"\",\"\",MAX($A$3:INDIRECT(\"A\" & TEXT(ROW()-1,\"@\")))+1)","v":168},"Y","シート③④","E",83,null,"","","",null,null,6,null,null,null,null,null,null,null,null,null,null,"","",null,""]
[{"$f":"IF($C171=\"\",\"\",MAX($A$3:INDIRECT(\"A\" & TEXT(ROW()-1,\"@\")))+1)","v":169},"Y","シート③④","E",84,null,"","","",null,null,6,null,null,null,null,null,null,null,null,null,null,"","",null,""]
[{"$f":"IF($C172=\"\",\"\",MAX($A$3:INDIRECT(\"A\" & TEXT(ROW()-1,\"@\")))+1)","v":170},"Y","シート③④","E",85,null,"晴","晴","D",null,null,6,null,null,null,null,null,null,null,null,null,null,"","",null,""]
[{"$f":"IF($C173=\"\",\"\",MAX($A$3:INDIRECT(\"A\" & TEXT(ROW()-1,\"@\")))+1)","v":171},"Y","シート③④","E",86,null,"","","",null,null,6,null,null,null,null,null,null,null,null,null,null,"","",null,""]
[{"$f":"IF($C174=\"\",\"\",MAX($A$3:INDIRECT(\"A\" & TEXT(ROW()-1,\"@\")))+1)","v":172},"Y","シート③④","E",87,null,"","","",null,null,6,null,null,null,null,null,null,null,null,null,null,"","",null,""]
[{"$f":"IF($C175=\"\",\"\",MAX($A$3:INDIRECT(\"A\" & TEXT(ROW()-1,\"@\")))+1)","v":173},"Y","シート③④","E",88,null,"","","",null,null,6,null,null,null,null,null,null,null,null,null,null,"","",null,""]
[{"$f":"IF($C176=\"\",\"\",MAX($A$3:INDIRECT(\"A\" & TEXT(ROW()-1,\"@\")))+1)","v":174},"Y","シート③④","E",89,null,"","","",null,null,6,null,null,null,null,null,null,null,null,null,null,"","",null,""]
[{"$f":"IF($C177=\"\",\"\",MAX($A$3:INDIRECT(\"A\" & TEXT(ROW()-1,\"@\")))+1)","v":175},"Y","シート③④","E",90,null,"","","",null,null,6,null,null,null,null,null,null,null,null,null,null,"","",null,""]
[{"$f":"IF($C178=\"\",\"\",MAX($A$3:INDIRECT(\"A\" & TEXT(ROW()-1,\"@\")))+1)","v":176},"Y","シート③④","E",91,null,"","","",null,null,6,null,null,null,null,null,null,null,null,null,null,"","",null,""]
[{"$f":"IF($C179=\"\",\"\",MAX($A$3:INDIRECT(\"A\" & TEXT(ROW()-1,\"@\")))+1)","v":177},"Y","シート③④","E",92,null,"","","",null,null,6,null,null,null,null,null,null,null,null,null,null,"","",null,""]
[{"$f":"IF($C180=\"\",\"\",MAX($A$3:INDIRECT(\"A\" & TEXT(ROW()-1,\"@\")))+1)","v":178},"Y","シート③④","E",93,null,"","","",null,null,6,null,null,null,null,null,null,null,null,null,null,"","",null,""]
[{"$f":"IF($C181=\"\",\"\",MAX($A$3:INDIRECT(\"A\" & TEXT(ROW()-1,\"@\")))+1)","v":179},"Y","シート③④","E",94,null,"晴","晴","D",null,null,6,null,null,null,null,null,null,null,null,null,null,"","",null,""]
[{"$f":"IF($C182=\"\",\"\",MAX($A$3:INDIRECT(\"A\" & TEXT(ROW()-1,\"@\")))+1)","v":180},"Y","シート③④","E",95,null,"","","",null,null,6,null,null,null,null,null,null,null,null,null,null,"","",null,""]
[{"$f":"IF($C183=\"\",\"\",MAX($A$3:INDIRECT(\"A\" & TEXT(ROW()-1,\"@\")))+1)","v":181},"Y","シート③④","E",96,null,"","","",null,null,6,null,null,null,null,null,null,null,null,null,null,"","",null,""]
[{"$f":"IF($C184=\"\",\"\",MAX($A$3:INDIRECT(\"A\" & TEXT(ROW()-1,\"@\")))+1)","v":182},"Y","シート③④","E",97,null,"晴","晴","D",null,null,6,null,null,null,null,null,null,null,null,null,null,"","",null,""]
[{"$f":"IF($C185=\"\",\"\",MAX($A$3:INDIRECT(\"A\" & TEXT(ROW()-1,\"@\")))+1)","v":183},"Y","シート③④","E",98,null,"","","",null,null,6,null,null,null,null,null,null,null,null,null,null,"","",null,""]
[{"$f":"IF($C186=\"\",\"\",MAX($A$3:INDIRECT(\"A\" & TEXT(ROW()-1,\"@\")))+1)","v":184},"Y","シート③④","E",99,null,"","","",null,null,6,null,null,null,null,null,null,null,null,null,null,"","",null,""]
[{"$f":"IF($C187=\"\",\"\",MAX($A$3:INDIRECT(\"A\" & TEXT(ROW()-1,\"@\")))+1)","v":185},"Y","シート③④","E",100,null,"晴","晴","D",null,null,6,null,null,null,null,null,null,null,null,null,null,"","",null,""]
[{"$f":"IF($C188=\"\",\"\",MAX($A$3:INDIRECT(\"A\" & TEXT(ROW()-1,\"@\")))+1)","v":186},"Y","シート③④","E",101,null,"","","",null,null,6,null,null,null,null,null,null,null,null,null,null,"","",null,""]
[{"$f":"IF($C189=\"\",\"\",MAX($A$3:INDIRECT(\"A\" & TEXT(ROW()-1,\"@\")))+1)","v":187},"Y","シート③④","E",102,null,"","","",null,null,6,null,null,null,null,null,null,null,null,null,null,"","",null,""]
[{"$f":"IF($C190=\"\",\"\",MAX($A$3:INDIRECT(\"A\" & TEXT(ROW()-1,\"@\")))+1)","v":188},"Y","シート③④","F",10,null,0.625,0.625,"D",null,null,null,"TIME",null,null,null,null,null,null,null,null,null,"","",null,""]
[{"$f":"IF($C191=\"\",\"\",MAX($A$3:INDIRECT(\"A\" & TEXT(ROW()-1,\"@\")))+1)","v":189},"Y","シート③④","F",11,null,"","","",null,null,null,"TIME",null,null,null,null,null,null,null,null,null,"","",null,""]
[{"$f":"IF($C192=\"\",\"\",MAX($A$3:INDIRECT(\"A\" & TEXT(ROW()-1,\"@\")))+1)","v":190},"Y","シート③④","F",12,null,"","","",null,null,null,"TIME",null,null,null,null,null,null,null,null,null,"","",null,""]
[{"$f":"IF($C193=\"\",\"\",MAX($A$3:INDIRECT(\"A\" & TEXT(ROW()-1,\"@\")))+1)","v":191},"Y","シート③④","F",13,null,0.33333333333333331,0.33333333333333331,"D",null,null,null,"TIME",null,null,null,null,null,null,null,null,null,"","",null,""]
[{"$f":"IF($C194=\"\",\"\",MAX($A$3:INDIRECT(\"A\" & TEXT(ROW()-1,\"@\")))+1)","v":192},"Y","シート③④","F",14,null,0.54166666666666663,0.54166666666666663,"D",null,null,null,"TIME",null,null,null,null,null,null,null,null,null,"","",null,""]
[{"$f":"IF($C195=\"\",\"\",MAX($A$3:INDIRECT(\"A\" & TEXT(ROW()-1,\"@\")))+1)","v":193},"Y","シート③④","F",15,null,0.70833333333333337,0.70833333333333337,"D",null,null,null,"TIME",null,null,null,null,null,null,null,null,null,{"$f":"IF(AND($B195=\"\",0<COUNTA($J195:$V195)),\"?\",\"\")","v":""},"",null,""]
[{"$f":"IF($C196=\"\",\"\",MAX($A$3:INDIRECT(\"A\" & TEXT(ROW()-1,\"@\")))+1)","v":194},"Y","シート③④","F",16,null,{"$f":"IFERROR(IF(ISBLANK(INDIRECT($C196 & \"!\" & $D196 & $E196)),\"\",INDIRECT($C196 & \"!\" & $D196 & $E196)),\"\")","v":0.33333333333333331},0.33333333333333331,{"$f":"IF($F196<>$H196,\"D\",\"\")","v":"D"},null,null,null,"TIME",null,null,null,null,null,null,null,null,null,"",{"$f":"IF(AND($B196<>\"\",OR($C196=\"\",$D196=\"\",$E196=\"\")),\"?\",\"\")","v":""},null,""]
[{"$f":"IF($C197=\"\",\"\",MAX($A$3:INDIRECT(\"A\" & TEXT(ROW()-1,\"@\")))+1)","v":195},"Y","シート③④","F",17,null,0.54166666666666663,0.54166666666666663,"D",null,null,null,"TIME",null,null,null,null,null,null,null,null,null,"","",null,{"$f":"IF(AND($H197<>\"\",$Y197<>\"\"),$H197,\"\")","v":""}]
[{"$f":"IF($C198=\"\",\"\",MAX($A$3:INDIRECT(\"A\" & TEXT(ROW()-1,\"@\")))+1)","v":196},"Y","シート③④","F",18,null,0.70833333333333337,{"$f":"IF(AND($B198<>\"\",$G198<>\"\"),$G198,\"\")","v":0.70833333333333337},"D",null,null,null,"TIME",null,null,null,null,null,null,null,null,null,"","",null,""]
[{"$f":"IF($C199=\"\",\"\",MAX($A$3:INDIRECT(\"A\" & TEXT(ROW()-1,\"@\")))+1)","v":197},"Y","シート③④","F",19,null,0.39583333333333331,0.39583333333333331,"D",null,null,null,"TIME",null,null,null,null,null,null,null,null,null,"","",null,""]
[{"$f":"IF($C200=\"\",\"\",MAX($A$3:INDIRECT(\"A\" & TEXT(ROW()-1,\"@\")))+1)","v":198},"Y","シート③④","F",20,null,"","","",null,null,null,"TIME",null,null,null,null,null,null,null,null,null,"","",null,""]
[{"$f":"IF($C201=\"\",\"\",MAX($A$3:INDIRECT(\"A\" & TEXT(ROW()-1,\"@\")))+1)","v":199},"Y","シート③④","F",21,null,"","","",null,null,null,"TIME",null,null,null,null,null,null,null,null,null,"","",null,""]
[{"$f":"IF($C202=\"\",\"\",MAX($A$3:INDIRECT(\"A\" & TEXT(ROW()-1,\"@\")))+1)","v":200},"Y","シート③④","F",22,null,0.33333333333333331,0.33333333333333331,"D",null,null,null,"TIME",null,null,null,null,null,null,null,null,null,"","",null,""]
[{"$f":"IF($C203=\"\",\"\",MAX($A$3:INDIRECT(\"A\" & TEXT(ROW()-1,\"@\")))+1)","v":201},"Y","シート③④","F",23,null,0.54166666666666663,0.54166666666666663,"D",null,null,null,"TIME",null,null,null,null,null,null,null,null,null,"","",null,""]
[{"$f":"IF($C204=\"\",\"\",MAX($A$3:INDIRECT(\"A\" & TEXT(ROW()-1,\"@\")))+1)","v":202},"Y","シート③④","F",24,null,0.70833333333333337,0.70833333333333337,"D",null,null,null,"TIME",null,null,null,null,null,null,null,null,null,"","",null,""]
[{"$f":"IF($C205=\"\",\"\",MAX($A$3:INDIRECT(\"A\" & TEXT(ROW()-1,\"@\")))+1)","v":203},"Y","シート③④","F",25,null,0.33333333333333331,0.33333333333333331,"D",null,null,null,"TIME",null,null,null,null,null,null,null,null,null,"","",null,""]
[{"$f":"IF($C206=\"\",\"\",MAX($A$3:INDIRECT(\"A\" & TEXT(ROW()-1,\"@\")))+1)","v":204},"Y","シート③④","F",26,null,0.54166666666666663,0.54166666666666663,"D",null,null,null,"TIME",null,null,null,null,null,null,null,null,null,"","",null,""]
[{"$f":"IF($C207=\"\",\"\",MAX($A$3:INDIRECT(\"A\" & TEXT(ROW()-1,\"@\")))+1)","v":205},"Y","シート③④","F",27,null,0.70833333333333337,0.70833333333333337,"D",null,null,null,"TIME",null,null,null,null,null,null,null,null,null,"","",null,""]
[{"$f":"IF($C208=\"\",\"\",MAX($A$3:INDIRECT(\"A\" & TEXT(ROW()-1,\"@\")))+1)","v":206},"Y","シート③④","F",28,null,0.33333333333333331,0.33333333333333331,"D",null,null,null,"TIME",null,null,null,null,null,null,null,null,null,"","",null,""]
[{"$f":"IF($C209=\"\",\"\",MAX($A$3:INDIRECT(\"A\" & TEXT(ROW()-1,\"@\")))+1)","v":207},"Y","シート③④","F",29,null,0.54166666666666663,0.54166666666666663,"D",null,null,null,"TIME",null,null,null,null,null,null,null,null,null,"","",null,""]
[{"$f":"IF($C210=\"\",\"\",MAX($A$3:INDIRECT(\"A\" & TEXT(ROW()-1,\"@\")))+1)","v":208},"Y","シート③④","F",30,null,0.70833333333333337,0.70833333333333337,"D",null,null,null,"TIME",null,null,null,null,null,null,null,null,null,"","",null,""]
[{"$f":"IF($C211=\"\",\"\",MAX($A$3:INDIRECT(\"A\" & TEXT(ROW()-1,\"@\")))+1)","v":209},"Y","シート③④","F",31,null,0.33333333333333331,0.33333333333333331,"D",null,null,null,"TIME",null,null,null,null,null,null,null,null,null,"","",null,""]
[{"$f":"IF($C212=\"\",\"\",MAX($A$3:INDIRECT(\"A\" & TEXT(ROW()-1,\"@\")))+1)","v":210},"Y","シート③④","F",32,null,0.54166666666666663,0.54166666666666663,"D",null,null,null,"TIME",null,null,null,null,null,null,null,null,null,"","",null,""]
[{"$f":"IF($C213=\"\",\"\",MAX($A$3:INDIRECT(\"A\" & TEXT(ROW()-1,\"@\")))+1)","v":211},"Y","シート③④","F",33,null,0.70833333333333337,0.70833333333333337,"D",null,null,null,"TIME",null,null,null,null,null,null,null,null,null,"","",null,""]
[{"$f":"IF($C214=\"\",\"\",MAX($A$3:INDIRECT(\"A\" & TEXT(ROW()-1,\"@\")))+1)","v":212},"Y","シート③④","F",34,null,0.33333333333333331,0.33333333333333331,"D",null,null,null,"TIME",null,null,null,null,null,null,null,null,null,"","",null,""]
[{"$f":"IF($C215=\"\",\"\",MAX($A$3:INDIRECT(\"A\" & TEXT(ROW()-1,\"@\")))+1)","v":213},"Y","シート③④","F",35,null,0.54166666666666663,0.54166666666666663,"D",null,null,null,"TIME",null,null,null,null,null,null,null,null,null,"","",null,""]
[{"$f":"IF($C216=\"\",\"\",MAX($A$3:INDIRECT(\"A\" & TEXT(ROW()-1,\"@\")))+1)","v":214},"Y","シート③④","F",36,null,0.70833333333333337,0.70833333333333337,"D",null,null,null,"TIME",null,null,null,null,null,null,null,null,null,"","",null,""]
[{"$f":"IF($C217=\"\",\"\",MAX($A$3:INDIRECT(\"A\" & TEXT(ROW()-1,\"@\")))+1)","v":215},"Y","シート③④","F",37,null,"","","",null,null,null,"TIME",null,null,null,null,null,null,null,null,null,"","",null,""]
[{"$f":"IF($C218=\"\",\"\",MAX($A$3:INDIRECT(\"A\" & TEXT(ROW()-1,\"@\")))+1)","v":216},"Y","シート③④","F",38,null,"","","",null,null,null,"TIME",null,null,null,null,null,null,null,null,null,"","",null,""]
[{"$f":"IF($C219=\"\",\"\",MAX($A$3:INDIRECT(\"A\" & TEXT(ROW()-1,\"@\")))+1)","v":217},"Y","シート③④","F",39,null,"","","",null,null,null,"TIME",null,null,null,null,null,null,null,null,null,"","",null,""]
[{"$f":"IF($C220=\"\",\"\",MAX($A$3:INDIRECT(\"A\" & TEXT(ROW()-1,\"@\")))+1)","v":218},"Y","シート③④","F",40,null,"","","",null,null,null,"TIME",null,null,null,null,null,null,null,null,null,"","",null,""]
[{"$f":"IF($C221=\"\",\"\",MAX($A$3:INDIRECT(\"A\" & TEXT(ROW()-1,\"@\")))+1)","v":219},"Y","シート③④","F",41,null,"","","",null,null,null,"TIME",null,null,null,null,null,null,null,null,null,"","",null,""]
[{"$f":"IF($C222=\"\",\"\",MAX($A$3:INDIRECT(\"A\" & TEXT(ROW()-1,\"@\")))+1)","v":220},"Y","シート③④","F",42,null,"","","",null,null,null,"TIME",null,null,null,null,null,null,null,null,null,"","",null,""]
[{"$f":"IF($C223=\"\",\"\",MAX($A$3:INDIRECT(\"A\" & TEXT(ROW()-1,\"@\")))+1)","v":221},"Y","シート③④","F",43,null,0.33333333333333331,0.33333333333333331,"D",null,null,null,"TIME",null,null,null,null,null,null,null,null,null,"","",null,""]
[{"$f":"IF($C224=\"\",\"\",MAX($A$3:INDIRECT(\"A\" & TEXT(ROW()-1,\"@\")))+1)","v":222},"Y","シート③④","F",44,null,0.54166666666666663,0.54166666666666663,"D",null,null,null,"TIME",null,null,null,null,null,null,null,null,null,"","",null,""]
[{"$f":"IF($C225=\"\",\"\",MAX($A$3:INDIRECT(\"A\" & TEXT(ROW()-1,\"@\")))+1)","v":223},"Y","シート③④","F",45,null,0.70833333333333337,0.70833333333333337,"D",null,null,null,"TIME",null,null,null,null,null,null,null,null,null,"","",null,""]
[{"$f":"IF($C226=\"\",\"\",MAX($A$3:INDIRECT(\"A\" & TEXT(ROW()-1,\"@\")))+1)","v":224},"Y","シート③④","F",46,null,0.33333333333333331,0.33333333333333331,"D",null,null,null,"TIME",null,null,null,null,null,null,null,null,null,"","",null,""]
[{"$f":"IF($C227=\"\",\"\",MAX($A$3:INDIRECT(\"A\" & TEXT(ROW()-1,\"@\")))+1)","v":225},"Y","シート③④","F",47,null,0.54166666666666663,0.54166666666666663,"D",null,null,null,"TIME",null,null,null,null,null,null,null,null,null,"","",null,""]
[{"$f":"IF($C228=\"\",\"\",MAX($A$3:INDIRECT(\"A\" & TEXT(ROW()-1,\"@\")))+1)","v":226},"Y","シート③④","F",48,null,0.70833333333333337,0.70833333333333337,"D",null,null,null,"TIME",null,null,null,null,null,null,null,null,null,"","",null,""]
[{"$f":"IF($C229=\"\",\"\",MAX($A$3:INDIRECT(\"A\" & TEXT(ROW()-1,\"@\")))+1)","v":227},"Y","シート③④","F",49,null,0.33333333333333331,0.33333333333333331,"D",null,null,null,"TIME",null,null,null,null,null,null,null,null,null,"","",null,""]
[{"$f":"IF($C230=\"\",\"\",MAX($A$3:INDIRECT(\"A\" & TEXT(ROW()-1,\"@\")))+1)","v":228},"Y","シート③④","F",50,null,0.54166666666666663,0.54166666666666663,"D",null,null,null,"TIME",null,null,null,null,null,null,null,null,null,"","",null,""]
[{"$f":"IF($C231=\"\",\"\",MAX($A$3:INDIRECT(\"A\" & TEXT(ROW()-1,\"@\")))+1)","v":229},"Y","シート③④","F",51,null,0.70833333333333337,0.70833333333333337,"D",null,null,null,"TIME",null,null,null,null,null,null,null,null,null,"","",null,""]
[{"$f":"IF($C232=\"\",\"\",MAX($A$3:INDIRECT(\"A\" & TEXT(ROW()-1,\"@\")))+1)","v":230},"Y","シート③④","F",52,null,0.33333333333333331,0.33333333333333331,"D",null,null,null,"TIME",null,null,null,null,null,null,null,null,null,"","",null,""]
[{"$f":"IF($C233=\"\",\"\",MAX($A$3:INDIRECT(\"A\" & TEXT(ROW()-1,\"@\")))+1)","v":231},"Y","シート③④","F",53,null,0.54166666666666663,0.54166666666666663,"D",null,null,null,"TIME",null,null,null,null,null,null,null,null,null,"","",null,""]
[{"$f":"IF($C234=\"\",\"\",MAX($A$3:INDIRECT(\"A\" & TEXT(ROW()-1,\"@\")))+1)","v":232},"Y","シート③④","F",54,null,0.70833333333333337,0.70833333333333337,"D",null,null,null,"TIME",null,null,null,null,null,null,null,null,null,"","",null,""]
[{"$f":"IF($C235=\"\",\"\",MAX($A$3:INDIRECT(\"A\" & TEXT(ROW()-1,\"@\")))+1)","v":233},"Y","シート③④","F",55,null,0.33333333333333331,0.33333333333333331,"D",null,null,null,"TIME",null,null,null,null,null,null,null,null,null,"","",null,""]
[{"$f":"IF($C236=\"\",\"\",MAX($A$3:INDIRECT(\"A\" & TEXT(ROW()-1,\"@\")))+1)","v":234},"Y","シート③④","F",56,null,0.54166666666666663,0.54166666666666663,"D",null,null,null,"TIME",null,null,null,null,null,null,null,null,null,"","",null,""]
[{"$f":"IF($C237=\"\",\"\",MAX($A$3:INDIRECT(\"A\" & TEXT(ROW()-1,\"@\")))+1)","v":235},"Y","シート③④","F",57,null,0.70833333333333337,0.70833333333333337,"D",null,null,null,"TIME",null,null,null,null,null,null,null,null,null,"","",null,""]
[{"$f":"IF($C238=\"\",\"\",MAX($A$3:INDIRECT(\"A\" & TEXT(ROW()-1,\"@\")))+1)","v":236},"Y","シート③④","F",58,null,0.33333333333333331,0.33333333333333331,"D",null,null,null,"TIME",null,null,null,null,null,null,null,null,null,"","",null,""]
[{"$f":"IF($C239=\"\",\"\",MAX($A$3:INDIRECT(\"A\" & TEXT(ROW()-1,\"@\")))+1)","v":237},"Y","シート③④","F",59,null,0.54166666666666663,0.54166666666666663,"D",null,null,null,"TIME",null,null,null,null,null,null,null,null,null,"","",null,""]
[{"$f":"IF($C240=\"\",\"\",MAX($A$3:INDIRECT(\"A\" & TEXT(ROW()-1,\"@\")))+1)","v":238},"Y","シート③④","F",60,null,0.70833333333333337,0.70833333333333337,"D",null,null,null,"TIME",null,null,null,null,null,null,null,null,null,"","",null,""]
[{"$f":"IF($C241=\"\",\"\",MAX($A$3:INDIRECT(\"A\" & TEXT(ROW()-1,\"@\")))+1)","v":239},"Y","シート③④","F",61,null,"","","",null,null,null,"TIME",null,null,null,null,null,null,null,null,null,"","",null,""]
[{"$f":"IF($C242=\"\",\"\",MAX($A$3:INDIRECT(\"A\" & TEXT(ROW()-1,\"@\")))+1)","v":240},"Y","シート③④","F",62,null,"","","",null,null,null,"TIME",null,null,null,null,null,null,null,null,null,"","",null,""]
[{"$f":"IF($C243=\"\",\"\",MAX($A$3:INDIRECT(\"A\" & TEXT(ROW()-1,\"@\")))+1)","v":241},"Y","シート③④","F",63,null,"","","",null,null,null,"TIME",null,null,null,null,null,null,null,null,null,"","",null,""]
[{"$f":"IF($C244=\"\",\"\",MAX($A$3:INDIRECT(\"A\" & TEXT(ROW()-1,\"@\")))+1)","v":242},"Y","シート③④","F",73,null,0.33333333333333331,0.33333333333333331,"D",null,null,null,"TIME",null,null,null,null,null,null,null,null,null,"","",null,""]
[{"$f":"IF($C245=\"\",\"\",MAX($A$3:INDIRECT(\"A\" & TEXT(ROW()-1,\"@\")))+1)","v":243},"Y","シート③④","F",74,null,"","","",null,null,null,"TIME",null,null,null,null,null,null,null,null,null,"","",null,""]
[{"$f":"IF($C246=\"\",\"\",MAX($A$3:INDIRECT(\"A\" & TEXT(ROW()-1,\"@\")))+1)","v":244},"Y","シート③④","F",75,null,"","","",null,null,null,"TIME",null,null,null,null,null,null,null,null,null,"","",null,""]
[{"$f":"IF($C247=\"\",\"\",MAX($A$3:INDIRECT(\"A\" & TEXT(ROW()-1,\"@\")))+1)","v":245},"Y","シート③④","F",76,null,0.33333333333333331,0.33333333333333331,"D",null,null,null,"TIME",null,null,null,null,null,null,null,null,null,"","",null,""]
[{"$f":"IF($C248=\"\",\"\",MAX($A$3:INDIRECT(\"A\" & TEXT(ROW()-1,\"@\")))+1)","v":246},"Y","シート③④","F",77,null,"","","",null,null,null,"TIME",null,null,null,null,null,null,null,null,null,"","",null,""]
[{"$f":"IF($C249=\"\",\"\",MAX($A$3:INDIRECT(\"A\" & TEXT(ROW()-1,\"@\")))+1)","v":247},"Y","シート③④","F",78,null,"","","",null,null,null,"TIME",null,null,null,null,null,null,null,null,null,"","",null,""]
[{"$f":"IF($C250=\"\",\"\",MAX($A$3:INDIRECT(\"A\" & TEXT(ROW()-1,\"@\")))+1)","v":248},"Y","シート③④","F",79,null,0.33333333333333331,0.33333333333333331,"D",null,null,null,"TIME",null,null,null,null,null,null,null,null,null,"","",null,""]
[{"$f":"IF($C251=\"\",\"\",MAX($A$3:INDIRECT(\"A\" & TEXT(ROW()-1,\"@\")))+1)","v":249},"Y","シート③④","F",80,null,"","","",null,null,null,"TIME",null,null,null,null,null,null,null,null,null,"","",null,""]
[{"$f":"IF($C252=\"\",\"\",MAX($A$3:INDIRECT(\"A\" & TEXT(ROW()-1,\"@\")))+1)","v":250},"Y","シート③④","F",81,null,"","","",null,null,null,"TIME",null,null,null,null,null,null,null,null,null,"","",null,""]
[{"$f":"IF($C253=\"\",\"\",MAX($A$3:INDIRECT(\"A\" & TEXT(ROW()-1,\"@\")))+1)","v":251},"Y","シート③④","F",82,null,0.33333333333333331,0.33333333333333331,"D",null,null,null,"TIME",null,null,null,null,null,null,null,null,null,"","",null,""]
[{"$f":"IF($C254=\"\",\"\",MAX($A$3:INDIRECT(\"A\" & TEXT(ROW()-1,\"@\")))+1)","v":252},"Y","シート③④","F",83,null,"","","",null,null,null,"TIME",null,null,null,null,null,null,null,null,null,"","",null,""]
[{"$f":"IF($C255=\"\",\"\",MAX($A$3:INDIRECT(\"A\" & TEXT(ROW()-1,\"@\")))+1)","v":253},"Y","シート③④","F",84,null,"","","",null,null,null,"TIME",null,null,null,null,null,null,null,null,null,"","",null,""]
[{"$f":"IF($C256=\"\",\"\",MAX($A$3:INDIRECT(\"A\" & TEXT(ROW()-1,\"@\")))+1)","v":254},"Y","シート③④","F",85,null,0.33333333333333331,0.33333333333333331,"D",null,null,null,"TIME",null,null,null,null,null,null,null,null,null,"","",null,""]
[{"$f":"IF($C257=\"\",\"\",MAX($A$3:INDIRECT(\"A\" & TEXT(ROW()-1,\"@\")))+1)","v":255},"Y","シート③④","F",86,null,"","","",null,null,null,"TIME",null,null,null,null,null,null,null,null,null,"","",null,""]
[{"$f":"IF($C258=\"\",\"\",MAX($A$3:INDIRECT(\"A\" & TEXT(ROW()-1,\"@\")))+1)","v":256},"Y","シート③④","F",87,null,"","","",null,null,null,"TIME",null,null,null,null,null,null,null,null,null,"","",null,""]
[{"$f":"IF($C259=\"\",\"\",MAX($A$3:INDIRECT(\"A\" & TEXT(ROW()-1,\"@\")))+1)","v":257},"Y","シート③④","F",88,null,"","","",null,null,null,"TIME",null,null,null,null,null,null,null,null,null,{"$f":"IF(AND($B259=\"\",0<COUNTA($J259:$V259)),\"?\",\"\")","v":""},"",null,""]
[{"$f":"IF($C260=\"\",\"\",MAX($A$3:INDIRECT(\"A\" & TEXT(ROW()-1,\"@\")))+1)","v":258},"Y","シート③④","F",89,null,{"$f":"IFERROR(IF(ISBLANK(INDIRECT($C260 & \"!\" & $D260 & $E260)),\"\",INDIRECT($C260 & \"!\" & $D260 & $E260)),\"\")","v":""},"",{"$f":"IF($F260<>$H260,\"D\",\"\")","v":""},null,null,null,"TIME",null,null,null,null,null,null,null,null,null,"",{"$f":"IF(AND($B260<>\"\",OR($C260=\"\",$D260=\"\",$E260=\"\")),\"?\",\"\")","v":""},null,""]
[{"$f":"IF($C261=\"\",\"\",MAX($A$3:INDIRECT(\"A\" & TEXT(ROW()-1,\"@\")))+1)","v":259},"Y","シート③④","F",90,null,"","","",null,null,null,"TIME",null,null,null,null,null,null,null,null,null,"","",null,{"$f":"IF(AND($H261<>\"\",$Y261<>\"\"),$H261,\"\")","v":""}]
[{"$f":"IF($C262=\"\",\"\",MAX($A$3:INDIRECT(\"A\" & TEXT(ROW()-1,\"@\")))+1)","v":260},"Y","シート③④","F",91,null,"",{"$f":"IF(AND($B262<>\"\",$G262<>\"\"),$G262,\"\")","v":""},"",null,null,null,"TIME",null,null,null,null,null,null,null,null,null,"","",null,""]
[{"$f":"IF($C263=\"\",\"\",MAX($A$3:INDIRECT(\"A\" & TEXT(ROW()-1,\"@\")))+1)","v":261},"Y","シート③④","F",92,null,"","","",null,null,null,"TIME",null,null,null,null,null,null,null,null,null,"","",null,""]
[{"$f":"IF($C264=\"\",\"\",MAX($A$3:INDIRECT(\"A\" & TEXT(ROW()-1,\"@\")))+1)","v":262},"Y","シート③④","F",93,null,"","","",null,null,null,"TIME",null,null,null,null,null,null,null,null,null,"","",null,""]
[{"$f":"IF($C265=\"\",\"\",MAX($A$3:INDIRECT(\"A\" & TEXT(ROW()-1,\"@\")))+1)","v":263},"Y","シート③④","F",94,null,0.33333333333333331,0.33333333333333331,"D",null,null,null,"TIME",null,null,null,null,null,null,null,null,null,"","",null,""]
[{"$f":"IF($C266=\"\",\"\",MAX($A$3:INDIRECT(\"A\" & TEXT(ROW()-1,\"@\")))+1)","v":264},"Y","シート③④","F",95,null,"","","",null,null,null,"TIME",null,null,null,null,null,null,null,null,null,"","",null,""]
[{"$f":"IF($C267=\"\",\"\",MAX($A$3:INDIRECT(\"A\" & TEXT(ROW()-1,\"@\")))+1)","v":265},"Y","シート③④","F",96,null,"","","",null,null,null,"TIME",null,null,null,null,null,null,null,null,null,"","",null,""]
[{"$f":"IF($C268=\"\",\"\",MAX($A$3:INDIRECT(\"A\" & TEXT(ROW()-1,\"@\")))+1)","v":266},"Y","シート③④","F",97,null,0.33333333333333331,0.33333333333333331,"D",null,null,null,"TIME",null,null,null,null,null,null,null,null,null,"","",null,""]
[{"$f":"IF($C269=\"\",\"\",MAX($A$3:INDIRECT(\"A\" & TEXT(ROW()-1,\"@\")))+1)","v":267},"Y","シート③④","F",98,null,"","","",null,null,null,"TIME",null,null,null,null,null,null,null,null,null,"","",null,""]
[{"$f":"IF($C270=\"\",\"\",MAX($A$3:INDIRECT(\"A\" & TEXT(ROW()-1,\"@\")))+1)","v":268},"Y","シート③④","F",99,null,"","","",null,null,null,"TIME",null,null,null,null,null,null,null,null,null,"","",null,""]
[{"$f":"IF($C271=\"\",\"\",MAX($A$3:INDIRECT(\"A\" & TEXT(ROW()-1,\"@\")))+1)","v":269},"Y","シート③④","F",100,null,0.33333333333333331,0.33333333333333331,"D",null,null,null,"TIME",null,null,null,null,null,null,null,null,null,"","",null,""]
[{"$f":"IF($C272=\"\",\"\",MAX($A$3:INDIRECT(\"A\" & TEXT(ROW()-1,\"@\")))+1)","v":270},"Y","シート③④","F",101,null,"","","",null,null,null,"TIME",null,null,null,null,null,null,null,null,null,"","",null,""]
[{"$f":"IF($C273=\"\",\"\",MAX($A$3:INDIRECT(\"A\" & TEXT(ROW()-1,\"@\")))+1)","v":271},"Y","シート③④","F",102,null,"","","",null,null,null,"TIME",null,null,null,null,null,null,null,null,null,"","",null,""]
[{"$f":"IF($C274=\"\",\"\",MAX($A$3:INDIRECT(\"A\" & TEXT(ROW()-1,\"@\")))+1)","v":272},"Y","シート③④","G",10,null,38,38,"D",null,"N",null,null,"MT",-273.14999999999998,null,null,null,null,null,null,null,"","",null,""]
[{"$f":"IF($C275=\"\",\"\",MAX($A$3:INDIRECT(\"A\" & TEXT(ROW()-1,\"@\")))+1)","v":273},"Y","シート③④","G",11,null,"","","",null,"N",null,null,"MT",-273.14999999999998,null,null,null,null,null,null,null,"","",null,""]
[{"$f":"IF($C276=\"\",\"\",MAX($A$3:INDIRECT(\"A\" & TEXT(ROW()-1,\"@\")))+1)","v":274},"Y","シート③④","G",12,null,"","","",null,"N",null,null,"MT",-273.14999999999998,null,null,null,null,null,null,null,"","",null,""]
[{"$f":"IF($C277=\"\",\"\",MAX($A$3:INDIRECT(\"A\" & TEXT(ROW()-1,\"@\")))+1)","v":275},"Y","シート③④","G",13,null,47,47,"D",null,"N",null,null,"MT",-273.14999999999998,null,null,null,null,null,null,null,"","",null,""]
[{"$f":"IF($C278=\"\",\"\",MAX($A$3:INDIRECT(\"A\" & TEXT(ROW()-1,\"@\")))+1)","v":276},"Y","シート③④","G",14,null,47.5,47.5,"D",null,"N",null,null,"MT",-273.14999999999998,null,null,null,null,null,null,null,"","",null,""]
[{"$f":"IF($C279=\"\",\"\",MAX($A$3:INDIRECT(\"A\" & TEXT(ROW()-1,\"@\")))+1)","v":277},"Y","シート③④","G",15,null,48,48,"D",null,"N",null,null,"MT",-273.14999999999998,null,null,null,null,null,null,null,"","",null,""]
[{"$f":"IF($C280=\"\",\"\",MAX($A$3:INDIRECT(\"A\" & TEXT(ROW()-1,\"@\")))+1)","v":278},"Y","シート③④","G",16,null,45,45,"D",null,"N",null,null,"MT",-273.14999999999998,null,null,null,null,null,null,null,"","",null,""]
[{"$f":"IF($C281=\"\",\"\",MAX($A$3:INDIRECT(\"A\" & TEXT(ROW()-1,\"@\")))+1)","v":279},"Y","シート③④","G",17,null,43,43,"D",null,"N",null,null,"MT",-273.14999999999998,null,null,null,null,null,null,null,"","",null,""]
[{"$f":"IF($C282=\"\",\"\",MAX($A$3:INDIRECT(\"A\" & TEXT(ROW()-1,\"@\")))+1)","v":280},"Y","シート③④","G",18,null,42,42,"D",null,"N",null,null,"MT",-273.14999999999998,null,null,null,null,null,null,null,"","",null,""]
[{"$f":"IF($C283=\"\",\"\",MAX($A$3:INDIRECT(\"A\" & TEXT(ROW()-1,\"@\")))+1)","v":281},"Y","シート③④","G",19,null,38,38,"D",null,"N",null,null,"MT",-273.14999999999998,null,null,null,null,null,null,null,"","",null,""]
[{"$f":"IF($C284=\"\",\"\",MAX($A$3:INDIRECT(\"A\" & TEXT(ROW()-1,\"@\")))+1)","v":282},"Y","シート③④","G",20,null,"","","",null,"N",null,null,"MT",-273.14999999999998,null,null,null,null,null,null,null,"","",null,""]
[{"$f":"IF($C285=\"\",\"\",MAX($A$3:INDIRECT(\"A\" & TEXT(ROW()-1,\"@\")))+1)","v":283},"Y","シート③④","G",21,null,"","","",null,"N",null,null,"MT",-273.14999999999998,null,null,null,null,null,null,null,"","",null,""]
[{"$f":"IF($C286=\"\",\"\",MAX($A$3:INDIRECT(\"A\" & TEXT(ROW()-1,\"@\")))+1)","v":284},"Y","シート③④","G",22,null,30,30,"D",null,"N",null,null,"MT",-273.14999999999998,null,null,null,null,null,null,null,"","",null,""]
[{"$f":"IF($C287=\"\",\"\",MAX($A$3:INDIRECT(\"A\" & TEXT(ROW()-1,\"@\")))+1)","v":285},"Y","シート③④","G",23,null,29,29,"D",null,"N",null,null,"MT",-273.14999999999998,null,null,null,null,null,null,null,"","",null,""]
[{"$f":"IF($C288=\"\",\"\",MAX($A$3:INDIRECT(\"A\" & TEXT(ROW()-1,\"@\")))+1)","v":286},"Y","シート③④","G",24,null,28,28,"D",null,"N",null,null,"MT",-273.14999999999998,null,null,null,null,null,null,null,"","",null,""]
[{"$f":"IF($C289=\"\",\"\",MAX($A$3:INDIRECT(\"A\" & TEXT(ROW()-1,\"@\")))+1)","v":287},"Y","シート③④","G",25,null,27,27,"D",null,"N",null,null,"MT",-273.14999999999998,null,null,null,null,null,null,null,"","",null,""]
[{"$f":"IF($C290=\"\",\"\",MAX($A$3:INDIRECT(\"A\" & TEXT(ROW()-1,\"@\")))+1)","v":288},"Y","シート③④","G",26,null,26.5,26.5,"D",null,"N",null,null,"MT",-273.14999999999998,null,null,null,null,null,null,null,"","",null,""]
[{"$f":"IF($C291=\"\",\"\",MAX($A$3:INDIRECT(\"A\" & TEXT(ROW()-1,\"@\")))+1)","v":289},"Y","シート③④","G",27,null,26,26,"D",null,"N",null,null,"MT",-273.14999999999998,null,null,null,null,null,null,null,"","",null,""]
[{"$f":"IF($C292=\"\",\"\",MAX($A$3:INDIRECT(\"A\" & TEXT(ROW()-1,\"@\")))+1)","v":290},"Y","シート③④","G",28,null,25.5,25.5,"D",null,"N",null,null,"MT",-273.14999999999998,null,null,null,null,null,null,null,"","",null,""]
[{"$f":"IF($C293=\"\",\"\",MAX($A$3:INDIRECT(\"A\" & TEXT(ROW()-1,\"@\")))+1)","v":291},"Y","シート③④","G",29,null,25,25,"D",null,"N",null,null,"MT",-273.14999999999998,null,null,null,null,null,null,null,"","",null,""]
[{"$f":"IF($C294=\"\",\"\",MAX($A$3:INDIRECT(\"A\" & TEXT(ROW()-1,\"@\")))+1)","v":292},"Y","シート③④","G",30,null,24.5,24.5,"D",null,"N",null,null,"MT",-273.14999999999998,null,null,null,null,null,null,null,"","",null,""]
[{"$f":"IF($C295=\"\",\"\",MAX($A$3:INDIRECT(\"A\" & TEXT(ROW()-1,\"@\")))+1)","v":293},"Y","シート③④","G",31,null,24,24,"D",null,"N",null,null,"MT",-273.14999999999998,null,null,null,null,null,null,null,"","",null,""]
[{"$f":"IF($C296=\"\",\"\",MAX($A$3:INDIRECT(\"A\" & TEXT(ROW()-1,\"@\")))+1)","v":294},"Y","シート③④","G",32,null,23.9,23.9,"D",null,"N",null,null,"MT",-273.14999999999998,null,null,null,null,null,null,null,"","",null,""]
[{"$f":"IF($C297=\"\",\"\",MAX($A$3:INDIRECT(\"A\" & TEXT(ROW()-1,\"@\")))+1)","v":295},"Y","シート③④","G",33,null,23.8,23.8,"D",null,"N",null,null,"MT",-273.14999999999998,null,null,null,null,null,null,null,"","",null,""]
[{"$f":"IF($C298=\"\",\"\",MAX($A$3:INDIRECT(\"A\" & TEXT(ROW()-1,\"@\")))+1)","v":296},"Y","シート③④","G",34,null,23.7,23.7,"D",null,"N",null,null,"MT",-273.14999999999998,null,null,null,null,null,null,null,"","",null,""]
[{"$f":"IF($C299=\"\",\"\",MAX($A$3:INDIRECT(\"A\" & TEXT(ROW()-1,\"@\")))+1)","v":297},"Y","シート③④","G",35,null,23.6,23.6,"D",null,"N",null,null,"MT",-273.14999999999998,null,null,null,null,null,null,null,"","",null,""]
[{"$f":"IF($C300=\"\",\"\",MAX($A$3:INDIRECT(\"A\" & TEXT(ROW()-1,\"@\")))+1)","v":298},"Y","シート③④","G",36,null,23.5,23.5,"D",null,"N",null,null,"MT",-273.14999999999998,null,null,null,null,null,null,null,"","",null,""]
[{"$f":"IF($C301=\"\",\"\",MAX($A$3:INDIRECT(\"A\" & TEXT(ROW()-1,\"@\")))+1)","v":299},"Y","シート③④","G",37,null,"","","",null,"N",null,null,"MT",-273.14999999999998,null,null,null,null,null,null,null,"","",null,""]
[{"$f":"IF($C302=\"\",\"\",MAX($A$3:INDIRECT(\"A\" & TEXT(ROW()-1,\"@\")))+1)","v":300},"Y","シート③④","G",38,null,"","","",null,"N",null,null,"MT",-273.14999999999998,null,null,null,null,null,null,null,"","",null,""]
[{"$f":"IF($C303=\"\",\"\",MAX($A$3:INDIRECT(\"A\" & TEXT(ROW()-1,\"@\")))+1)","v":301},"Y","シート③④","G",39,null,"","","",null,"N",null,null,"MT",-273.14999999999998,null,null,null,null,null,null,null,"","",null,""]
[{"$f":"IF($C304=\"\",\"\",MAX($A$3:INDIRECT(\"A\" & TEXT(ROW()-1,\"@\")))+1)","v":302},"Y","シート③④","G",40,null,"","","",null,"N",null,null,"MT",-273.14999999999998,null,null,null,null,null,null,null,"","",null,""]
[{"$f":"IF($C305=\"\",\"\",MAX($A$3:INDIRECT(\"A\" & TEXT(ROW()-1,\"@\")))+1)","v":303},"Y","シート③④","G",41,null,"","","",null,"N",null,null,"MT",-273.14999999999998,null,null,null,null,null,null,null,"","",null,""]
[{"$f":"IF($C306=\"\",\"\",MAX($A$3:INDIRECT(\"A\" & TEXT(ROW()-1,\"@\")))+1)","v":304},"Y","シート③④","G",42,null,"","","",null,"N",null,null,"MT",-273.14999999999998,null,null,null,null,null,null,null,"","",null,""]
[{"$f":"IF($C307=\"\",\"\",MAX($A$3:INDIRECT(\"A\" & TEXT(ROW()-1,\"@\")))+1)","v":305},"Y","シート③④","G",43,null,22.8,22.8,"D",null,"N",null,null,"MT",-273.14999999999998,null,null,null,null,null,null,null,"","",null,""]
[{"$f":"IF($C308=\"\",\"\",MAX($A$3:INDIRECT(\"A\" & TEXT(ROW()-1,\"@\")))+1)","v":306},"Y","シート③④","G",44,null,22.7,22.7,"D",null,"N",null,null,"MT",-273.14999999999998,null,null,null,null,null,null,null,"","",null,""]
[{"$f":"IF($C309=\"\",\"\",MAX($A$3:INDIRECT(\"A\" & TEXT(ROW()-1,\"@\")))+1)","v":307},"Y","シート③④","G",45,null,22.6,22.6,"D",null,"N",null,null,"MT",-273.14999999999998,null,null,null,null,null,null,null,"","",null,""]
[{"$f":"IF($C310=\"\",\"\",MAX($A$3:INDIRECT(\"A\" & TEXT(ROW()-1,\"@\")))+1)","v":308},"Y","シート③④","G",46,null,22.5,22.5,"D",null,"N",null,null,"MT",-273.14999999999998,null,null,null,null,null,null,null,"","",null,""]
[{"$f":"IF($C311=\"\",\"\",MAX($A$3:INDIRECT(\"A\" & TEXT(ROW()-1,\"@\")))+1)","v":309},"Y","シート③④","G",47,null,22.4,22.4,"D",null,"N",null,null,"MT",-273.14999999999998,null,null,null,null,null,null,null,"","",null,""]
[{"$f":"IF($C312=\"\",\"\",MAX($A$3:INDIRECT(\"A\" & TEXT(ROW()-1,\"@\")))+1)","v":310},"Y","シート③④","G",48,null,22.3,22.3,"D",null,"N",null,null,"MT",-273.14999999999998,null,null,null,null,null,null,null,"","",null,""]
[{"$f":"IF($C313=\"\",\"\",MAX($A$3:INDIRECT(\"A\" & TEXT(ROW()-1,\"@\")))+1)","v":311},"Y","シート③④","G",49,null,22.2,22.2,"D",null,"N",null,null,"MT",-273.14999999999998,null,null,null,null,null,null,null,"","",null,""]
[{"$f":"IF($C314=\"\",\"\",MAX($A$3:INDIRECT(\"A\" & TEXT(ROW()-1,\"@\")))+1)","v":312},"Y","シート③④","G",50,null,22.1,22.1,"D",null,"N",null,null,"MT",-273.14999999999998,null,null,null,null,null,null,null,"","",null,""]
[{"$f":"IF($C315=\"\",\"\",MAX($A$3:INDIRECT(\"A\" & TEXT(ROW()-1,\"@\")))+1)","v":313},"Y","シート③④","G",51,null,22,22,"D",null,"N",null,null,"MT",-273.14999999999998,null,null,null,null,null,null,null,"","",null,""]
[{"$f":"IF($C316=\"\",\"\",MAX($A$3:INDIRECT(\"A\" & TEXT(ROW()-1,\"@\")))+1)","v":314},"Y","シート③④","G",52,null,21.9,21.9,"D",null,"N",null,null,"MT",-273.14999999999998,null,null,null,null,null,null,null,"","",null,""]
[{"$f":"IF($C317=\"\",\"\",MAX($A$3:INDIRECT(\"A\" & TEXT(ROW()-1,\"@\")))+1)","v":315},"Y","シート③④","G",53,null,21.8,21.8,"D",null,"N",null,null,"MT",-273.14999999999998,null,null,null,null,null,null,null,"","",null,""]
[{"$f":"IF($C318=\"\",\"\",MAX($A$3:INDIRECT(\"A\" & TEXT(ROW()-1,\"@\")))+1)","v":316},"Y","シート③④","G",54,null,21.7,21.7,"D",null,"N",null,null,"MT",-273.14999999999998,null,null,null,null,null,null,null,"","",null,""]
[{"$f":"IF($C319=\"\",\"\",MAX($A$3:INDIRECT(\"A\" & TEXT(ROW()-1,\"@\")))+1)","v":317},"Y","シート③④","G",55,null,21.6,21.6,"D",null,"N",null,null,"MT",-273.14999999999998,null,null,null,null,null,null,null,"","",null,""]
[{"$f":"IF($C320=\"\",\"\",MAX($A$3:INDIRECT(\"A\" & TEXT(ROW()-1,\"@\")))+1)","v":318},"Y","シート③④","G",56,null,21.5,21.5,"D",null,"N",null,null,"MT",-273.14999999999998,null,null,null,null,null,null,null,"","",null,""]
[{"$f":"IF($C321=\"\",\"\",MAX($A$3:INDIRECT(\"A\" & TEXT(ROW()-1,\"@\")))+1)","v":319},"Y","シート③④","G",57,null,21.4,21.4,"D",null,"N",null,null,"MT",-273.14999999999998,null,null,null,null,null,null,null,"","",null,""]
[{"$f":"IF($C322=\"\",\"\",MAX($A$3:INDIRECT(\"A\" & TEXT(ROW()-1,\"@\")))+1)","v":320},"Y","シート③④","G",58,null,21.3,21.3,"D",null,"N",null,null,"MT",-273.14999999999998,null,null,null,null,null,null,null,"","",null,""]
[{"$f":"IF($C323=\"\",\"\",MAX($A$3:INDIRECT(\"A\" & TEXT(ROW()-1,\"@\")))+1)","v":321},"Y","シート③④","G",59,null,21.4,21.4,"D",null,"N",null,null,"MT",-273.14999999999998,null,null,null,null,null,null,null,{"$f":"IF(AND($B323=\"\",0<COUNTA($J323:$V323)),\"?\",\"\")","v":""},"",null,""]
[{"$f":"IF($C324=\"\",\"\",MAX($A$3:INDIRECT(\"A\" & TEXT(ROW()-1,\"@\")))+1)","v":322},"Y","シート③④","G",60,null,{"$f":"IFERROR(IF(ISBLANK(INDIRECT($C324 & \"!\" & $D324 & $E324)),\"\",INDIRECT($C324 & \"!\" & $D324 & $E324)),\"\")","v":21.5},21.5,{"$f":"IF($F324<>$H324,\"D\",\"\")","v":"D"},null,"N",null,null,"MT",-273.14999999999998,null,null,null,null,null,null,null,"",{"$f":"IF(AND($B324<>\"\",OR($C324=\"\",$D324=\"\",$E324=\"\")),\"?\",\"\")","v":""},null,""]
[{"$f":"IF($C325=\"\",\"\",MAX($A$3:INDIRECT(\"A\" & TEXT(ROW()-1,\"@\")))+1)","v":323},"Y","シート③④","G",61,null,"","","",null,"N",null,null,"MT",-273.14999999999998,null,null,null,null,null,null,null,"","",null,{"$f":"IF(AND($H325<>\"\",$Y325<>\"\"),$H325,\"\")","v":""}]
[{"$f":"IF($C326=\"\",\"\",MAX($A$3:INDIRECT(\"A\" & TEXT(ROW()-1,\"@\")))+1)","v":324},"Y","シート③④","G",62,null,"",{"$f":"IF(AND($B326<>\"\",$G326<>\"\"),$G326,\"\")","v":""},"",null,"N",null,null,"MT",-273.14999999999998,null,null,null,null,null,null,null,"","",null,""]
[{"$f":"IF($C327=\"\",\"\",MAX($A$3:INDIRECT(\"A\" & TEXT(ROW()-1,\"@\")))+1)","v":325},"Y","シート③④","G",63,null,"","","",null,"N",null,null,"MT",-273.14999999999998,null,null,null,null,null,null,null,"","",null,""]
[{"$f":"IF($C328=\"\",\"\",MAX($A$3:INDIRECT(\"A\" & TEXT(ROW()-1,\"@\")))+1)","v":326},"Y","シート③④","G",73,null,21.9,21.9,"D",null,"N",null,null,"MT",-273.14999999999998,null,null,null,null,null,null,null,"","",null,""]
[{"$f":"IF($C329=\"\",\"\",MAX($A$3:INDIRECT(\"A\" & TEXT(ROW()-1,\"@\")))+1)","v":327},"Y","シート③④","G",74,null,"","","",null,"N",null,null,"MT",-273.14999999999998,null,null,null,null,null,null,null,"","",null,""]
[{"$f":"IF($C330=\"\",\"\",MAX($A$3:INDIRECT(\"A\" & TEXT(ROW()-1,\"@\")))+1)","v":328},"Y","シート③④","G",75,null,"","","",null,"N",null,null,"MT",-273.14999999999998,null,null,null,null,null,null,null,"","",null,""]
[{"$f":"IF($C331=\"\",\"\",MAX($A$3:INDIRECT(\"A\" & TEXT(ROW()-1,\"@\")))+1)","v":329},"Y","シート③④","G",76,null,22,22,"D",null,"N",null,null,"MT",-273.14999999999998,null,null,null,null,null,null,null,"","",null,""]
[{"$f":"IF($C332=\"\",\"\",MAX($A$3:INDIRECT(\"A\" & TEXT(ROW()-1,\"@\")))+1)","v":330},"Y","シート③④","G",77,null,"","","",null,"N",null,null,"MT",-273.14999999999998,null,null,null,null,null,null,null,"","",null,""]
[{"$f":"IF($C333=\"\",\"\",MAX($A$3:INDIRECT(\"A\" & TEXT(ROW()-1,\"@\")))+1)","v":331},"Y","シート③④","G",78,null,"","","",null,"N",null,null,"MT",-273.14999999999998,null,null,null,null,null,null,null,"","",null,""]
[{"$f":"IF($C334=\"\",\"\",MAX($A$3:INDIRECT(\"A\" & TEXT(ROW()-1,\"@\")))+1)","v":332},"Y","シート③④","G",79,null,22,22,"D",null,"N",null,null,"MT",-273.14999999999998,null,null,null,null,null,null,null,"","",null,""]
[{"$f":"IF($C335=\"\",\"\",MAX($A$3:INDIRECT(\"A\" & TEXT(ROW()-1,\"@\")))+1)","v":333},"Y","シート③④","G",80,null,"","","",null,"N",null,null,"MT",-273.14999999999998,null,null,null,null,null,null,null,"","",null,""]
[{"$f":"IF($C336=\"\",\"\",MAX($A$3:INDIRECT(\"A\" & TEXT(ROW()-1,\"@\")))+1)","v":334},"Y","シート③④","G",81,null,"","","",null,"N",null,null,"MT",-273.14999999999998,null,null,null,null,null,null,null,"","",null,""]
[{"$f":"IF($C337=\"\",\"\",MAX($A$3:INDIRECT(\"A\" & TEXT(ROW()-1,\"@\")))+1)","v":335},"Y","シート③④","G",82,null,22,22,"D",null,"N",null,null,"MT",-273.14999999999998,null,null,null,null,null,null,null,"","",null,""]
[{"$f":"IF($C338=\"\",\"\",MAX($A$3:INDIRECT(\"A\" & TEXT(ROW()-1,\"@\")))+1)","v":336},"Y","シート③④","G",83,null,"","","",null,"N",null,null,"MT",-273.14999999999998,null,null,null,null,null,null,null,"","",null,""]
[{"$f":"IF($C339=\"\",\"\",MAX($A$3:INDIRECT(\"A\" & TEXT(ROW()-1,\"@\")))+1)","v":337},"Y","シート③④","G",84,null,"","","",null,"N",null,null,"MT",-273.14999999999998,null,null,null,null,null,null,null,"","",null,""]
[{"$f":"IF($C340=\"\",\"\",MAX($A$3:INDIRECT(\"A\" & TEXT(ROW()-1,\"@\")))+1)","v":338},"Y","シート③④","G",85,null,22,22,"D",null,"N",null,null,"MT",-273.14999999999998,null,null,null,null,null,null,null,"","",null,""]
[{"$f":"IF($C341=\"\",\"\",MAX($A$3:INDIRECT(\"A\" & TEXT(ROW()-1,\"@\")))+1)","v":339},"Y","シート③④","G",86,null,"","","",null,"N",null,null,"MT",-273.14999999999998,null,null,null,null,null,null,null,"","",null,""]
[{"$f":"IF($C342=\"\",\"\",MAX($A$3:INDIRECT(\"A\" & TEXT(ROW()-1,\"@\")))+1)","v":340},"Y","シート③④","G",87,null,"","","",null,"N",null,null,"MT",-273.14999999999998,null,null,null,null,null,null,null,"","",null,""]
[{"$f":"IF($C343=\"\",\"\",MAX($A$3:INDIRECT(\"A\" & TEXT(ROW()-1,\"@\")))+1)","v":341},"Y","シート③④","G",88,null,"","","",null,"N",null,null,"MT",-273.14999999999998,null,null,null,null,null,null,null,"","",null,""]
[{"$f":"IF($C344=\"\",\"\",MAX($A$3:INDIRECT(\"A\" & TEXT(ROW()-1,\"@\")))+1)","v":342},"Y","シート③④","G",89,null,"","","",null,"N",null,null,"MT",-273.14999999999998,null,null,null,null,null,null,null,"","",null,""]
[{"$f":"IF($C345=\"\",\"\",MAX($A$3:INDIRECT(\"A\" & TEXT(ROW()-1,\"@\")))+1)","v":343},"Y","シート③④","G",90,null,"","","",null,"N",null,null,"MT",-273.14999999999998,null,null,null,null,null,null,null,"","",null,""]
[{"$f":"IF($C346=\"\",\"\",MAX($A$3:INDIRECT(\"A\" & TEXT(ROW()-1,\"@\")))+1)","v":344},"Y","シート③④","G",91,null,"","","",null,"N",null,null,"MT",-273.14999999999998,null,null,null,null,null,null,null,"","",null,""]
[{"$f":"IF($C347=\"\",\"\",MAX($A$3:INDIRECT(\"A\" & TEXT(ROW()-1,\"@\")))+1)","v":345},"Y","シート③④","G",92,null,"","","",null,"N",null,null,"MT",-273.14999999999998,null,null,null,null,null,null,null,"","",null,""]
[{"$f":"IF($C348=\"\",\"\",MAX($A$3:INDIRECT(\"A\" & TEXT(ROW()-1,\"@\")))+1)","v":346},"Y","シート③④","G",93,null,"","","",null,"N",null,null,"MT",-273.14999999999998,null,null,null,null,null,null,null,"","",null,""]
[{"$f":"IF($C349=\"\",\"\",MAX($A$3:INDIRECT(\"A\" & TEXT(ROW()-1,\"@\")))+1)","v":347},"Y","シート③④","G",94,null,22.3,22.3,"D",null,"N",null,null,"MT",-273.14999999999998,null,null,null,null,null,null,null,"","",null,""]
[{"$f":"IF($C350=\"\",\"\",MAX($A$3:INDIRECT(\"A\" & TEXT(ROW()-1,\"@\")))+1)","v":348},"Y","シート③④","G",95,null,"","","",null,"N",null,null,"MT",-273.14999999999998,null,null,null,null,null,null,null,"","",null,""]
[{"$f":"IF($C351=\"\",\"\",MAX($A$3:INDIRECT(\"A\" & TEXT(ROW()-1,\"@\")))+1)","v":349},"Y","シート③④","G",96,null,"","","",null,"N",null,null,"MT",-273.14999999999998,null,null,null,null,null,null,null,"","",null,""]
[{"$f":"IF($C352=\"\",\"\",MAX($A$3:INDIRECT(\"A\" & TEXT(ROW()-1,\"@\")))+1)","v":350},"Y","シート③④","G",97,null,22.4,22.4,"D",null,"N",null,null,"MT",-273.14999999999998,null,null,null,null,null,null,null,"","",null,""]
[{"$f":"IF($C353=\"\",\"\",MAX($A$3:INDIRECT(\"A\" & TEXT(ROW()-1,\"@\")))+1)","v":351},"Y","シート③④","G",98,null,"","","",null,"N",null,null,"MT",-273.14999999999998,null,null,null,null,null,null,null,"","",null,""]
[{"$f":"IF($C354=\"\",\"\",MAX($A$3:INDIRECT(\"A\" & TEXT(ROW()-1,\"@\")))+1)","v":352},"Y","シート③④","G",99,null,"","","",null,"N",null,null,"MT",-273.14999999999998,null,null,null,null,null,null,null,"","",null,""]
[{"$f":"IF($C355=\"\",\"\",MAX($A$3:INDIRECT(\"A\" & TEXT(ROW()-1,\"@\")))+1)","v":353},"Y","シート③④","G",100,null,22.5,22.5,"D",null,"N",null,null,"MT",-273.14999999999998,null,null,null,null,null,null,null,"","",null,""]
[{"$f":"IF($C356=\"\",\"\",MAX($A$3:INDIRECT(\"A\" & TEXT(ROW()-1,\"@\")))+1)","v":354},"Y","シート③④","G",101,null,"","","",null,"N",null,null,"MT",-273.14999999999998,null,null,null,null,null,null,null,"","",null,""]
[{"$f":"IF($C357=\"\",\"\",MAX($A$3:INDIRECT(\"A\" & TEXT(ROW()-1,\"@\")))+1)","v":355},"Y","シート③④","G",102,null,"","","",null,"N",null,null,"MT",-273.14999999999998,null,null,null,null,null,null,null,"","",null,""]
[{"$f":"IF($C358=\"\",\"\",MAX($A$3:INDIRECT(\"A\" & TEXT(ROW()-1,\"@\")))+1)","v":356},"Y","シート③④","I",10,null,23,23,"D",null,"N",null,null,"MT",-273.14999999999998,null,null,null,null,null,null,null,"","",null,""]
[{"$f":"IF($C359=\"\",\"\",MAX($A$3:INDIRECT(\"A\" & TEXT(ROW()-1,\"@\")))+1)","v":357},"Y","シート③④","I",11,null,"","","",null,"N",null,null,"MT",-273.14999999999998,null,null,null,null,null,null,null,"","",null,""]
[{"$f":"IF($C360=\"\",\"\",MAX($A$3:INDIRECT(\"A\" & TEXT(ROW()-1,\"@\")))+1)","v":358},"Y","シート③④","I",12,null,"","","",null,"N",null,null,"MT",-273.14999999999998,null,null,null,null,null,null,null,"","",null,""]
[{"$f":"IF($C361=\"\",\"\",MAX($A$3:INDIRECT(\"A\" & TEXT(ROW()-1,\"@\")))+1)","v":359},"Y","シート③④","I",13,null,22,22,"D",null,"N",null,null,"MT",-273.14999999999998,null,null,null,null,null,null,null,"","",null,""]
[{"$f":"IF($C362=\"\",\"\",MAX($A$3:INDIRECT(\"A\" & TEXT(ROW()-1,\"@\")))+1)","v":360},"Y","シート③④","I",14,null,26,26,"D",null,"N",null,null,"MT",-273.14999999999998,null,null,null,null,null,null,null,"","",null,""]
[{"$f":"IF($C363=\"\",\"\",MAX($A$3:INDIRECT(\"A\" & TEXT(ROW()-1,\"@\")))+1)","v":361},"Y","シート③④","I",15,null,23,23,"D",null,"N",null,null,"MT",-273.14999999999998,null,null,null,null,null,null,null,"","",null,""]
[{"$f":"IF($C364=\"\",\"\",MAX($A$3:INDIRECT(\"A\" & TEXT(ROW()-1,\"@\")))+1)","v":362},"Y","シート③④","I",16,null,22,22,"D",null,"N",null,null,"MT",-273.14999999999998,null,null,null,null,null,null,null,"","",null,""]
[{"$f":"IF($C365=\"\",\"\",MAX($A$3:INDIRECT(\"A\" & TEXT(ROW()-1,\"@\")))+1)","v":363},"Y","シート③④","I",17,null,26,26,"D",null,"N",null,null,"MT",-273.14999999999998,null,null,null,null,null,null,null,"","",null,""]
[{"$f":"IF($C366=\"\",\"\",MAX($A$3:INDIRECT(\"A\" & TEXT(ROW()-1,\"@\")))+1)","v":364},"Y","シート③④","I",18,null,23,23,"D",null,"N",null,null,"MT",-273.14999999999998,null,null,null,null,null,null,null,"","",null,""]
[{"$f":"IF($C367=\"\",\"\",MAX($A$3:INDIRECT(\"A\" & TEXT(ROW()-1,\"@\")))+1)","v":365},"Y","シート③④","I",19,null,22,22,"D",null,"N",null,null,"MT",-273.14999999999998,null,null,null,null,null,null,null,"","",null,""]
[{"$f":"IF($C368=\"\",\"\",MAX($A$3:INDIRECT(\"A\" & TEXT(ROW()-1,\"@\")))+1)","v":366},"Y","シート③④","I",20,null,"","","",null,"N",null,null,"MT",-273.14999999999998,null,null,null,null,null,null,null,"","",null,""]
[{"$f":"IF($C369=\"\",\"\",MAX($A$3:INDIRECT(\"A\" & TEXT(ROW()-1,\"@\")))+1)","v":367},"Y","シート③④","I",21,null,"","","",null,"N",null,null,"MT",-273.14999999999998,null,null,null,null,null,null,null,"","",null,""]
[{"$f":"IF($C370=\"\",\"\",MAX($A$3:INDIRECT(\"A\" & TEXT(ROW()-1,\"@\")))+1)","v":368},"Y","シート③④","I",22,null,22,22,"D",null,"N",null,null,"MT",-273.14999999999998,null,null,null,null,null,null,null,"","",null,""]
[{"$f":"IF($C371=\"\",\"\",MAX($A$3:INDIRECT(\"A\" & TEXT(ROW()-1,\"@\")))+1)","v":369},"Y","シート③④","I",23,null,26,26,"D",null,"N",null,null,"MT",-273.14999999999998,null,null,null,null,null,null,null,"","",null,""]
[{"$f":"IF($C372=\"\",\"\",MAX($A$3:INDIRECT(\"A\" & TEXT(ROW()-1,\"@\")))+1)","v":370},"Y","シート③④","I",24,null,23,23,"D",null,"N",null,null,"MT",-273.14999999999998,null,null,null,null,null,null,null,"","",null,""]
[{"$f":"IF($C373=\"\",\"\",MAX($A$3:INDIRECT(\"A\" & TEXT(ROW()-1,\"@\")))+1)","v":371},"Y","シート③④","I",25,null,22,22,"D",null,"N",null,null,"MT",-273.14999999999998,null,null,null,null,null,null,null,"","",null,""]
[{"$f":"IF($C374=\"\",\"\",MAX($A$3:INDIRECT(\"A\" & TEXT(ROW()-1,\"@\")))+1)","v":372},"Y","シート③④","I",26,null,26,26,"D",null,"N",null,null,"MT",-273.14999999999998,null,null,null,null,null,null,null,"","",null,""]
[{"$f":"IF($C375=\"\",\"\",MAX($A$3:INDIRECT(\"A\" & TEXT(ROW()-1,\"@\")))+1)","v":373},"Y","シート③④","I",27,null,23,23,"D",null,"N",null,null,"MT",-273.14999999999998,null,null,null,null,null,null,null,"","",null,""]
[{"$f":"IF($C376=\"\",\"\",MAX($A$3:INDIRECT(\"A\" & TEXT(ROW()-1,\"@\")))+1)","v":374},"Y","シート③④","I",28,null,22,22,"D",null,"N",null,null,"MT",-273.14999999999998,null,null,null,null,null,null,null,"","",null,""]
[{"$f":"IF($C377=\"\",\"\",MAX($A$3:INDIRECT(\"A\" & TEXT(ROW()-1,\"@\")))+1)","v":375},"Y","シート③④","I",29,null,26,26,"D",null,"N",null,null,"MT",-273.14999999999998,null,null,null,null,null,null,null,"","",null,""]
[{"$f":"IF($C378=\"\",\"\",MAX($A$3:INDIRECT(\"A\" & TEXT(ROW()-1,\"@\")))+1)","v":376},"Y","シート③④","I",30,null,23,23,"D",null,"N",null,null,"MT",-273.14999999999998,null,null,null,null,null,null,null,"","",null,""]
[{"$f":"IF($C379=\"\",\"\",MAX($A$3:INDIRECT(\"A\" & TEXT(ROW()-1,\"@\")))+1)","v":377},"Y","シート③④","I",31,null,23,23,"D",null,"N",null,null,"MT",-273.14999999999998,null,null,null,null,null,null,null,"","",null,""]
[{"$f":"IF($C380=\"\",\"\",MAX($A$3:INDIRECT(\"A\" & TEXT(ROW()-1,\"@\")))+1)","v":378},"Y","シート③④","I",32,null,27,27,"D",null,"N",null,null,"MT",-273.14999999999998,null,null,null,null,null,null,null,"","",null,""]
[{"$f":"IF($C381=\"\",\"\",MAX($A$3:INDIRECT(\"A\" & TEXT(ROW()-1,\"@\")))+1)","v":379},"Y","シート③④","I",33,null,24,24,"D",null,"N",null,null,"MT",-273.14999999999998,null,null,null,null,null,null,null,"","",null,""]
[{"$f":"IF($C382=\"\",\"\",MAX($A$3:INDIRECT(\"A\" & TEXT(ROW()-1,\"@\")))+1)","v":380},"Y","シート③④","I",34,null,23,23,"D",null,"N",null,null,"MT",-273.14999999999998,null,null,null,null,null,null,null,"","",null,""]
[{"$f":"IF($C383=\"\",\"\",MAX($A$3:INDIRECT(\"A\" & TEXT(ROW()-1,\"@\")))+1)","v":381},"Y","シート③④","I",35,null,27,27,"D",null,"N",null,null,"MT",-273.14999999999998,null,null,null,null,null,null,null,"","",null,""]
[{"$f":"IF($C384=\"\",\"\",MAX($A$3:INDIRECT(\"A\" & TEXT(ROW()-1,\"@\")))+1)","v":382},"Y","シート③④","I",36,null,24,24,"D",null,"N",null,null,"MT",-273.14999999999998,null,null,null,null,null,null,null,"","",null,""]
[{"$f":"IF($C385=\"\",\"\",MAX($A$3:INDIRECT(\"A\" & TEXT(ROW()-1,\"@\")))+1)","v":383},"Y","シート③④","I",37,null,"","","",null,"N",null,null,"MT",-273.14999999999998,null,null,null,null,null,null,null,"","",null,""]
[{"$f":"IF($C386=\"\",\"\",MAX($A$3:INDIRECT(\"A\" & TEXT(ROW()-1,\"@\")))+1)","v":384},"Y","シート③④","I",38,null,"","","",null,"N",null,null,"MT",-273.14999999999998,null,null,null,null,null,null,null,"","",null,""]
[{"$f":"IF($C387=\"\",\"\",MAX($A$3:INDIRECT(\"A\" & TEXT(ROW()-1,\"@\")))+1)","v":385},"Y","シート③④","I",39,null,"","","",null,"N",null,null,"MT",-273.14999999999998,null,null,null,null,null,null,null,{"$f":"IF(AND($B387=\"\",0<COUNTA($J387:$V387)),\"?\",\"\")","v":""},"",null,""]
[{"$f":"IF($C388=\"\",\"\",MAX($A$3:INDIRECT(\"A\" & TEXT(ROW()-1,\"@\")))+1)","v":386},"Y","シート③④","I",40,null,{"$f":"IFERROR(IF(ISBLANK(INDIRECT($C388 & \"!\" & $D388 & $E388)),\"\",INDIRECT($C388 & \"!\" & $D388 & $E388)),\"\")","v":""},"",{"$f":"IF($F388<>$H388,\"D\",\"\")","v":""},null,"N",null,null,"MT",-273.14999999999998,null,null,null,null,null,null,null,"",{"$f":"IF(AND($B388<>\"\",OR($C388=\"\",$D388=\"\",$E388=\"\")),\"?\",\"\")","v":""},null,""]
[{"$f":"IF($C389=\"\",\"\",MAX($A$3:INDIRECT(\"A\" & TEXT(ROW()-1,\"@\")))+1)","v":387},"Y","シート③④","I",41,null,"","","",null,"N",null,null,"MT",-273.14999999999998,null,null,null,null,null,null,null,"","",null,{"$f":"IF(AND($H389<>\"\",$Y389<>\"\"),$H389,\"\")","v":""}]
[{"$f":"IF($C390=\"\",\"\",MAX($A$3:INDIRECT(\"A\" & TEXT(ROW()-1,\"@\")))+1)","v":388},"Y","シート③④","I",42,null,"",{"$f":"IF(AND($B390<>\"\",$G390<>\"\"),$G390,\"\")","v":""},"",null,"N",null,null,"MT",-273.14999999999998,null,null,null,null,null,null,null,"","",null,""]
[{"$f":"IF($C391=\"\",\"\",MAX($A$3:INDIRECT(\"A\" & TEXT(ROW()-1,\"@\")))+1)","v":389},"Y","シート③④","I",43,null,23,23,"D",null,"N",null,null,"MT",-273.14999999999998,null,null,null,null,null,null,null,"","",null,""]
[{"$f":"IF($C392=\"\",\"\",MAX($A$3:INDIRECT(\"A\" & TEXT(ROW()-1,\"@\")))+1)","v":390},"Y","シート③④","I",44,null,27,27,"D",null,"N",null,null,"MT",-273.14999999999998,null,null,null,null,null,null,null,"","",null,""]
[{"$f":"IF($C393=\"\",\"\",MAX($A$3:INDIRECT(\"A\" & TEXT(ROW()-1,\"@\")))+1)","v":391},"Y","シート③④","I",45,null,24,24,"D",null,"N",null,null,"MT",-273.14999999999998,null,null,null,null,null,null,null,"","",null,""]
[{"$f":"IF($C394=\"\",\"\",MAX($A$3:INDIRECT(\"A\" & TEXT(ROW()-1,\"@\")))+1)","v":392},"Y","シート③④","I",46,null,23,23,"D",null,"N",null,null,"MT",-273.14999999999998,null,null,null,null,null,null,null,"","",null,""]
[{"$f":"IF($C395=\"\",\"\",MAX($A$3:INDIRECT(\"A\" & TEXT(ROW()-1,\"@\")))+1)","v":393},"Y","シート③④","I",47,null,27,27,"D",null,"N",null,null,"MT",-273.14999999999998,null,null,null,null,null,null,null,"","",null,""]
[{"$f":"IF($C396=\"\",\"\",MAX($A$3:INDIRECT(\"A\" & TEXT(ROW()-1,\"@\")))+1)","v":394},"Y","シート③④","I",48,null,24,24,"D",null,"N",null,null,"MT",-273.14999999999998,null,null,null,null,null,null,null,"","",null,""]
[{"$f":"IF($C397=\"\",\"\",MAX($A$3:INDIRECT(\"A\" & TEXT(ROW()-1,\"@\")))+1)","v":395},"Y","シート③④","I",49,null,23,23,"D",null,"N",null,null,"MT",-273.14999999999998,null,null,null,null,null,null,null,"","",null,""]
[{"$f":"IF($C398=\"\",\"\",MAX($A$3:INDIRECT(\"A\" & TEXT(ROW()-1,\"@\")))+1)","v":396},"Y","シート③④","I",50,null,27,27,"D",null,"N",null,null,"MT",-273.14999999999998,null,null,null,null,null,null,null,"","",null,""]
[{"$f":"IF($C399=\"\",\"\",MAX($A$3:INDIRECT(\"A\" & TEXT(ROW()-1,\"@\")))+1)","v":397},"Y","シート③④","I",51,null,24,24,"D",null,"N",null,null,"MT",-273.14999999999998,null,null,null,null,null,null,null,"","",null,""]
[{"$f":"IF($C400=\"\",\"\",MAX($A$3:INDIRECT(\"A\" & TEXT(ROW()-1,\"@\")))+1)","v":398},"Y","シート③④","I",52,null,23,23,"D",null,"N",null,null,"MT",-273.14999999999998,null,null,null,null,null,null,null,"","",null,""]
[{"$f":"IF($C401=\"\",\"\",MAX($A$3:INDIRECT(\"A\" & TEXT(ROW()-1,\"@\")))+1)","v":399},"Y","シート③④","I",53,null,28,28,"D",null,"N",null,null,"MT",-273.14999999999998,null,null,null,null,null,null,null,"","",null,""]
[{"$f":"IF($C402=\"\",\"\",MAX($A$3:INDIRECT(\"A\" & TEXT(ROW()-1,\"@\")))+1)","v":400},"Y","シート③④","I",54,null,25,25,"D",null,"N",null,null,"MT",-273.14999999999998,null,null,null,null,null,null,null,"","",null,""]
[{"$f":"IF($C403=\"\",\"\",MAX($A$3:INDIRECT(\"A\" & TEXT(ROW()-1,\"@\")))+1)","v":401},"Y","シート③④","I",55,null,23,23,"D",null,"N",null,null,"MT",-273.14999999999998,null,null,null,null,null,null,null,"","",null,""]
[{"$f":"IF($C404=\"\",\"\",MAX($A$3:INDIRECT(\"A\" & TEXT(ROW()-1,\"@\")))+1)","v":402},"Y","シート③④","I",56,null,28,28,"D",null,"N",null,null,"MT",-273.14999999999998,null,null,null,null,null,null,null,"","",null,""]
[{"$f":"IF($C405=\"\",\"\",MAX($A$3:INDIRECT(\"A\" & TEXT(ROW()-1,\"@\")))+1)","v":403},"Y","シート③④","I",57,null,25,25,"D",null,"N",null,null,"MT",-273.14999999999998,null,null,null,null,null,null,null,"","",null,""]
[{"$f":"IF($C406=\"\",\"\",MAX($A$3:INDIRECT(\"A\" & TEXT(ROW()-1,\"@\")))+1)","v":404},"Y","シート③④","I",58,null,23,23,"D",null,"N",null,null,"MT",-273.14999999999998,null,null,null,null,null,null,null,"","",null,""]
[{"$f":"IF($C407=\"\",\"\",MAX($A$3:INDIRECT(\"A\" & TEXT(ROW()-1,\"@\")))+1)","v":405},"Y","シート③④","I",59,null,28,28,"D",null,"N",null,null,"MT",-273.14999999999998,null,null,null,null,null,null,null,"","",null,""]
[{"$f":"IF($C408=\"\",\"\",MAX($A$3:INDIRECT(\"A\" & TEXT(ROW()-1,\"@\")))+1)","v":406},"Y","シート③④","I",60,null,25,25,"D",null,"N",null,null,"MT",-273.14999999999998,null,null,null,null,null,null,null,"","",null,""]
[{"$f":"IF($C409=\"\",\"\",MAX($A$3:INDIRECT(\"A\" & TEXT(ROW()-1,\"@\")))+1)","v":407},"Y","シート③④","I",61,null,"","","",null,"N",null,null,"MT",-273.14999999999998,null,null,null,null,null,null,null,"","",null,""]
[{"$f":"IF($C410=\"\",\"\",MAX($A$3:INDIRECT(\"A\" & TEXT(ROW()-1,\"@\")))+1)","v":408},"Y","シート③④","I",62,null,"","","",null,"N",null,null,"MT",-273.14999999999998,null,null,null,null,null,null,null,"","",null,""]
[{"$f":"IF($C411=\"\",\"\",MAX($A$3:INDIRECT(\"A\" & TEXT(ROW()-1,\"@\")))+1)","v":409},"Y","シート③④","I",63,null,"","","",null,"N",null,null,"MT",-273.14999999999998,null,null,null,null,null,null,null,"","",null,""]
[{"$f":"IF($C412=\"\",\"\",MAX($A$3:INDIRECT(\"A\" & TEXT(ROW()-1,\"@\")))+1)","v":410},"Y","シート③④","I",73,null,23,23,"D",null,"N",null,null,"MT",-273.14999999999998,null,null,null,null,null,null,null,"","",null,""]
[{"$f":"IF($C413=\"\",\"\",MAX($A$3:INDIRECT(\"A\" & TEXT(ROW()-1,\"@\")))+1)","v":411},"Y","シート③④","I",74,null,"","","",null,"N",null,null,"MT",-273.14999999999998,null,null,null,null,null,null,null,"","",null,""]
[{"$f":"IF($C414=\"\",\"\",MAX($A$3:INDIRECT(\"A\" & TEXT(ROW()-1,\"@\")))+1)","v":412},"Y","シート③④","I",75,null,"","","",null,"N",null,null,"MT",-273.14999999999998,null,null,null,null,null,null,null,"","",null,""]
[{"$f":"IF($C415=\"\",\"\",MAX($A$3:INDIRECT(\"A\" & TEXT(ROW()-1,\"@\")))+1)","v":413},"Y","シート③④","I",76,null,23,23,"D",null,"N",null,null,"MT",-273.14999999999998,null,null,null,null,null,null,null,"","",null,""]
[{"$f":"IF($C416=\"\",\"\",MAX($A$3:INDIRECT(\"A\" & TEXT(ROW()-1,\"@\")))+1)","v":414},"Y","シート③④","I",77,null,"","","",null,"N",null,null,"MT",-273.14999999999998,null,null,null,null,null,null,null,"","",null,""]
[{"$f":"IF($C417=\"\",\"\",MAX($A$3:INDIRECT(\"A\" & TEXT(ROW()-1,\"@\")))+1)","v":415},"Y","シート③④","I",78,null,"","","",null,"N",null,null,"MT",-273.14999999999998,null,null,null,null,null,null,null,"","",null,""]
[{"$f":"IF($C418=\"\",\"\",MAX($A$3:INDIRECT(\"A\" & TEXT(ROW()-1,\"@\")))+1)","v":416},"Y","シート③④","I",79,null,23,23,"D",null,"N",null,null,"MT",-273.14999999999998,null,null,null,null,null,null,null,"","",null,""]
[{"$f":"IF($C419=\"\",\"\",MAX($A$3:INDIRECT(\"A\" & TEXT(ROW()-1,\"@\")))+1)","v":417},"Y","シート③④","I",80,null,"","","",null,"N",null,null,"MT",-273.14999999999998,null,null,null,null,null,null,null,"","",null,""]
[{"$f":"IF($C420=\"\",\"\",MAX($A$3:INDIRECT(\"A\" & TEXT(ROW()-1,\"@\")))+1)","v":418},"Y","シート③④","I",81,null,"","","",null,"N",null,null,"MT",-273.14999999999998,null,null,null,null,null,null,null,"","",null,""]
[{"$f":"IF($C421=\"\",\"\",MAX($A$3:INDIRECT(\"A\" & TEXT(ROW()-1,\"@\")))+1)","v":419},"Y","シート③④","I",82,null,23,23,"D",null,"N",null,null,"MT",-273.14999999999998,null,null,null,null,null,null,null,"","",null,""]
[{"$f":"IF($C422=\"\",\"\",MAX($A$3:INDIRECT(\"A\" & TEXT(ROW()-1,\"@\")))+1)","v":420},"Y","シート③④","I",83,null,"","","",null,"N",null,null,"MT",-273.14999999999998,null,null,null,null,null,null,null,"","",null,""]
[{"$f":"IF($C423=\"\",\"\",MAX($A$3:INDIRECT(\"A\" & TEXT(ROW()-1,\"@\")))+1)","v":421},"Y","シート③④","I",84,null,"","","",null,"N",null,null,"MT",-273.14999999999998,null,null,null,null,null,null,null,"","",null,""]
[{"$f":"IF($C424=\"\",\"\",MAX($A$3:INDIRECT(\"A\" & TEXT(ROW()-1,\"@\")))+1)","v":422},"Y","シート③④","I",85,null,23,23,"D",null,"N",null,null,"MT",-273.14999999999998,null,null,null,null,null,null,null,"","",null,""]
[{"$f":"IF($C425=\"\",\"\",MAX($A$3:INDIRECT(\"A\" & TEXT(ROW()-1,\"@\")))+1)","v":423},"Y","シート③④","I",86,null,"","","",null,"N",null,null,"MT",-273.14999999999998,null,null,null,null,null,null,null,"","",null,""]
[{"$f":"IF($C426=\"\",\"\",MAX($A$3:INDIRECT(\"A\" & TEXT(ROW()-1,\"@\")))+1)","v":424},"Y","シート③④","I",87,null,"","","",null,"N",null,null,"MT",-273.14999999999998,null,null,null,null,null,null,null,"","",null,""]
[{"$f":"IF($C427=\"\",\"\",MAX($A$3:INDIRECT(\"A\" & TEXT(ROW()-1,\"@\")))+1)","v":425},"Y","シート③④","I",88,null,"","","",null,"N",null,null,"MT",-273.14999999999998,null,null,null,null,null,null,null,"","",null,""]
[{"$f":"IF($C428=\"\",\"\",MAX($A$3:INDIRECT(\"A\" & TEXT(ROW()-1,\"@\")))+1)","v":426},"Y","シート③④","I",89,null,"","","",null,"N",null,null,"MT",-273.14999999999998,null,null,null,null,null,null,null,"","",null,""]
[{"$f":"IF($C429=\"\",\"\",MAX($A$3:INDIRECT(\"A\" & TEXT(ROW()-1,\"@\")))+1)","v":427},"Y","シート③④","I",90,null,"","","",null,"N",null,null,"MT",-273.14999999999998,null,null,null,null,null,null,null,"","",null,""]
[{"$f":"IF($C430=\"\",\"\",MAX($A$3:INDIRECT(\"A\" & TEXT(ROW()-1,\"@\")))+1)","v":428},"Y","シート③④","I",91,null,"","","",null,"N",null,null,"MT",-273.14999999999998,null,null,null,null,null,null,null,"","",null,""]
[{"$f":"IF($C431=\"\",\"\",MAX($A$3:INDIRECT(\"A\" & TEXT(ROW()-1,\"@\")))+1)","v":429},"Y","シート③④","I",92,null,"","","",null,"N",null,null,"MT",-273.14999999999998,null,null,null,null,null,null,null,"","",null,""]
[{"$f":"IF($C432=\"\",\"\",MAX($A$3:INDIRECT(\"A\" & TEXT(ROW()-1,\"@\")))+1)","v":430},"Y","シート③④","I",93,null,"","","",null,"N",null,null,"MT",-273.14999999999998,null,null,null,null,null,null,null,"","",null,""]
[{"$f":"IF($C433=\"\",\"\",MAX($A$3:INDIRECT(\"A\" & TEXT(ROW()-1,\"@\")))+1)","v":431},"Y","シート③④","I",94,null,23.5,23.5,"D",null,"N",null,null,"MT",-273.14999999999998,null,null,null,null,null,null,null,"","",null,""]
[{"$f":"IF($C434=\"\",\"\",MAX($A$3:INDIRECT(\"A\" & TEXT(ROW()-1,\"@\")))+1)","v":432},"Y","シート③④","I",95,null,"","","",null,"N",null,null,"MT",-273.14999999999998,null,null,null,null,null,null,null,"","",null,""]
[{"$f":"IF($C435=\"\",\"\",MAX($A$3:INDIRECT(\"A\" & TEXT(ROW()-1,\"@\")))+1)","v":433},"Y","シート③④","I",96,null,"","","",null,"N",null,null,"MT",-273.14999999999998,null,null,null,null,null,null,null,"","",null,""]
[{"$f":"IF($C436=\"\",\"\",MAX($A$3:INDIRECT(\"A\" & TEXT(ROW()-1,\"@\")))+1)","v":434},"Y","シート③④","I",97,null,23.5,23.5,"D",null,"N",null,null,"MT",-273.14999999999998,null,null,null,null,null,null,null,"","",null,""]
[{"$f":"IF($C437=\"\",\"\",MAX($A$3:INDIRECT(\"A\" & TEXT(ROW()-1,\"@\")))+1)","v":435},"Y","シート③④","I",98,null,"","","",null,"N",null,null,"MT",-273.14999999999998,null,null,null,null,null,null,null,"","",null,""]
[{"$f":"IF($C438=\"\",\"\",MAX($A$3:INDIRECT(\"A\" & TEXT(ROW()-1,\"@\")))+1)","v":436},"Y","シート③④","I",99,null,"","","",null,"N",null,null,"MT",-273.14999999999998,null,null,null,null,null,null,null,"","",null,""]
[{"$f":"IF($C439=\"\",\"\",MAX($A$3:INDIRECT(\"A\" & TEXT(ROW()-1,\"@\")))+1)","v":437},"Y","シート③④","I",100,null,23.5,23.5,"D",null,"N",null,null,"MT",-273.14999999999998,null,null,null,null,null,null,null,"","",null,""]
[{"$f":"IF($C440=\"\",\"\",MAX($A$3:INDIRECT(\"A\" & TEXT(ROW()-1,\"@\")))+1)","v":438},"Y","シート③④","I",101,null,"","","",null,"N",null,null,"MT",-273.14999999999998,null,null,null,null,null,null,null,"","",null,""]
[{"$f":"IF($C441=\"\",\"\",MAX($A$3:INDIRECT(\"A\" & TEXT(ROW()-1,\"@\")))+1)","v":439},"Y","シート③④","I",102,null,"","","",null,"N",null,null,"MT",-273.14999999999998,null,null,null,null,null,null,null,"","",null,""]
[{"$f":"IF($C442=\"\",\"\",MAX($A$3:INDIRECT(\"A\" & TEXT(ROW()-1,\"@\")))+1)","v":440},"Y","シート③④","K",10,null,"","","",null,null,102,null,null,null,null,null,null,null,null,null,null,"","",null,""]
[{"$f":"IF($C443=\"\",\"\",MAX($A$3:INDIRECT(\"A\" & TEXT(ROW()-1,\"@\")))+1)","v":441},"Y","シート③④","K",11,null,"","","",null,null,102,null,null,null,null,null,null,null,null,null,null,"","",null,""]
[{"$f":"IF($C444=\"\",\"\",MAX($A$3:INDIRECT(\"A\" & TEXT(ROW()-1,\"@\")))+1)","v":442},"Y","シート③④","K",12,null,"","","",null,null,102,null,null,null,null,null,null,null,null,null,null,"","",null,""]
[{"$f":"IF($C445=\"\",\"\",MAX($A$3:INDIRECT(\"A\" & TEXT(ROW()-1,\"@\")))+1)","v":443},"Y","シート③④","K",13,null,"","","",null,null,102,null,null,null,null,null,null,null,null,null,null,"","",null,""]
[{"$f":"IF($C446=\"\",\"\",MAX($A$3:INDIRECT(\"A\" & TEXT(ROW()-1,\"@\")))+1)","v":444},"Y","シート③④","K",14,null,"","","",null,null,102,null,null,null,null,null,null,null,null,null,null,"","",null,""]
[{"$f":"IF($C447=\"\",\"\",MAX($A$3:INDIRECT(\"A\" & TEXT(ROW()-1,\"@\")))+1)","v":445},"Y","シート③④","K",15,null,"","","",null,null,102,null,null,null,null,null,null,null,null,null,null,"","",null,""]
[{"$f":"IF($C448=\"\",\"\",MAX($A$3:INDIRECT(\"A\" & TEXT(ROW()-1,\"@\")))+1)","v":446},"Y","シート③④","K",16,null,"","","",null,null,102,null,null,null,null,null,null,null,null,null,null,"","",null,""]
[{"$f":"IF($C449=\"\",\"\",MAX($A$3:INDIRECT(\"A\" & TEXT(ROW()-1,\"@\")))+1)","v":447},"Y","シート③④","K",17,null,"","","",null,null,102,null,null,null,null,null,null,null,null,null,null,"","",null,""]
[{"$f":"IF($C450=\"\",\"\",MAX($A$3:INDIRECT(\"A\" & TEXT(ROW()-1,\"@\")))+1)","v":448},"Y","シート③④","K",18,null,"","","",null,null,102,null,null,null,null,null,null,null,null,null,null,"","",null,""]
[{"$f":"IF($C451=\"\",\"\",MAX($A$3:INDIRECT(\"A\" & TEXT(ROW()-1,\"@\")))+1)","v":449},"Y","シート③④","K",19,null,"","","",null,null,102,null,null,null,null,null,null,null,null,null,null,{"$f":"IF(AND($B451=\"\",0<COUNTA($J451:$V451)),\"?\",\"\")","v":""},"",null,""]
[{"$f":"IF($C452=\"\",\"\",MAX($A$3:INDIRECT(\"A\" & TEXT(ROW()-1,\"@\")))+1)","v":450},"Y","シート③④","K",20,null,{"$f":"IFERROR(IF(ISBLANK(INDIRECT($C452 & \"!\" & $D452 & $E452)),\"\",INDIRECT($C452 & \"!\" & $D452 & $E452)),\"\")","v":""},"",{"$f":"IF($F452<>$H452,\"D\",\"\")","v":""},null,null,102,null,null,null,null,null,null,null,null,null,null,"",{"$f":"IF(AND($B452<>\"\",OR($C452=\"\",$D452=\"\",$E452=\"\")),\"?\",\"\")","v":""},null,""]
[{"$f":"IF($C453=\"\",\"\",MAX($A$3:INDIRECT(\"A\" & TEXT(ROW()-1,\"@\")))+1)","v":451},"Y","シート③④","K",21,null,"","","",null,null,102,null,null,null,null,null,null,null,null,null,null,"","",null,{"$f":"IF(AND($H453<>\"\",$Y453<>\"\"),$H453,\"\")","v":""}]
[{"$f":"IF($C454=\"\",\"\",MAX($A$3:INDIRECT(\"A\" & TEXT(ROW()-1,\"@\")))+1)","v":452},"Y","シート③④","K",22,null,"",{"$f":"IF(AND($B454<>\"\",$G454<>\"\"),$G454,\"\")","v":""},"",null,null,102,null,null,null,null,null,null,null,null,null,null,"","",null,""]
[{"$f":"IF($C455=\"\",\"\",MAX($A$3:INDIRECT(\"A\" & TEXT(ROW()-1,\"@\")))+1)","v":453},"Y","シート③④","K",23,null,"","","",null,null,102,null,null,null,null,null,null,null,null,null,null,"","",null,""]
[{"$f":"IF($C456=\"\",\"\",MAX($A$3:INDIRECT(\"A\" & TEXT(ROW()-1,\"@\")))+1)","v":454},"Y","シート③④","K",24,null,"","","",null,null,102,null,null,null,null,null,null,null,null,null,null,"","",null,""]
[{"$f":"IF($C457=\"\",\"\",MAX($A$3:INDIRECT(\"A\" & TEXT(ROW()-1,\"@\")))+1)","v":455},"Y","シート③④","K",25,null,"","","",null,null,102,null,null,null,null,null,null,null,null,null,null,"","",null,""]
[{"$f":"IF($C458=\"\",\"\",MAX($A$3:INDIRECT(\"A\" & TEXT(ROW()-1,\"@\")))+1)","v":456},"Y","シート③④","K",26,null,"","","",null,null,102,null,null,null,null,null,null,null,null,null,null,"","",null,""]
[{"$f":"IF($C459=\"\",\"\",MAX($A$3:INDIRECT(\"A\" & TEXT(ROW()-1,\"@\")))+1)","v":457},"Y","シート③④","K",27,null,"","","",null,null,102,null,null,null,null,null,null,null,null,null,null,"","",null,""]
[{"$f":"IF($C460=\"\",\"\",MAX($A$3:INDIRECT(\"A\" & TEXT(ROW()-1,\"@\")))+1)","v":458},"Y","シート③④","K",28,null,"","","",null,null,102,null,null,null,null,null,null,null,null,null,null,"","",null,""]
[{"$f":"IF($C461=\"\",\"\",MAX($A$3:INDIRECT(\"A\" & TEXT(ROW()-1,\"@\")))+1)","v":459},"Y","シート③④","K",29,null,"","","",null,null,102,null,null,null,null,null,null,null,null,null,null,"","",null,""]
[{"$f":"IF($C462=\"\",\"\",MAX($A$3:INDIRECT(\"A\" & TEXT(ROW()-1,\"@\")))+1)","v":460},"Y","シート③④","K",30,null,"","","",null,null,102,null,null,null,null,null,null,null,null,null,null,"","",null,""]
[{"$f":"IF($C463=\"\",\"\",MAX($A$3:INDIRECT(\"A\" & TEXT(ROW()-1,\"@\")))+1)","v":461},"Y","シート③④","K",31,null,"","","",null,null,102,null,null,null,null,null,null,null,null,null,null,"","",null,""]
[{"$f":"IF($C464=\"\",\"\",MAX($A$3:INDIRECT(\"A\" & TEXT(ROW()-1,\"@\")))+1)","v":462},"Y","シート③④","K",32,null,"","","",null,null,102,null,null,null,null,null,null,null,null,null,null,"","",null,""]
[{"$f":"IF($C465=\"\",\"\",MAX($A$3:INDIRECT(\"A\" & TEXT(ROW()-1,\"@\")))+1)","v":463},"Y","シート③④","K",33,null,"","","",null,null,102,null,null,null,null,null,null,null,null,null,null,"","",null,""]
[{"$f":"IF($C466=\"\",\"\",MAX($A$3:INDIRECT(\"A\" & TEXT(ROW()-1,\"@\")))+1)","v":464},"Y","シート③④","K",34,null,"","","",null,null,102,null,null,null,null,null,null,null,null,null,null,"","",null,""]
[{"$f":"IF($C467=\"\",\"\",MAX($A$3:INDIRECT(\"A\" & TEXT(ROW()-1,\"@\")))+1)","v":465},"Y","シート③④","K",35,null,"","","",null,null,102,null,null,null,null,null,null,null,null,null,null,"","",null,""]
[{"$f":"IF($C468=\"\",\"\",MAX($A$3:INDIRECT(\"A\" & TEXT(ROW()-1,\"@\")))+1)","v":466},"Y","シート③④","K",36,null,"","","",null,null,102,null,null,null,null,null,null,null,null,null,null,"","",null,""]
[{"$f":"IF($C469=\"\",\"\",MAX($A$3:INDIRECT(\"A\" & TEXT(ROW()-1,\"@\")))+1)","v":467},"Y","シート③④","K",37,null,"","","",null,null,102,null,null,null,null,null,null,null,null,null,null,"","",null,""]
[{"$f":"IF($C470=\"\",\"\",MAX($A$3:INDIRECT(\"A\" & TEXT(ROW()-1,\"@\")))+1)","v":468},"Y","シート③④","K",38,null,"","","",null,null,102,null,null,null,null,null,null,null,null,null,null,"","",null,""]
[{"$f":"IF($C471=\"\",\"\",MAX($A$3:INDIRECT(\"A\" & TEXT(ROW()-1,\"@\")))+1)","v":469},"Y","シート③④","K",39,null,"","","",null,null,102,null,null,null,null,null,null,null,null,null,null,"","",null,""]
[{"$f":"IF($C472=\"\",\"\",MAX($A$3:INDIRECT(\"A\" & TEXT(ROW()-1,\"@\")))+1)","v":470},"Y","シート③④","K",40,null,"","","",null,null,102,null,null,null,null,null,null,null,null,null,null,"","",null,""]
[{"$f":"IF($C473=\"\",\"\",MAX($A$3:INDIRECT(\"A\" & TEXT(ROW()-1,\"@\")))+1)","v":471},"Y","シート③④","K",41,null,"","","",null,null,102,null,null,null,null,null,null,null,null,null,null,"","",null,""]
[{"$f":"IF($C474=\"\",\"\",MAX($A$3:INDIRECT(\"A\" & TEXT(ROW()-1,\"@\")))+1)","v":472},"Y","シート③④","K",42,null,"","","",null,null,102,null,null,null,null,null,null,null,null,null,null,"","",null,""]
[{"$f":"IF($C475=\"\",\"\",MAX($A$3:INDIRECT(\"A\" & TEXT(ROW()-1,\"@\")))+1)","v":473},"Y","シート③④","K",43,null,"","","",null,null,102,null,null,null,null,null,null,null,null,null,null,"","",null,""]
[{"$f":"IF($C476=\"\",\"\",MAX($A$3:INDIRECT(\"A\" & TEXT(ROW()-1,\"@\")))+1)","v":474},"Y","シート③④","K",44,null,"","","",null,null,102,null,null,null,null,null,null,null,null,null,null,"","",null,""]
[{"$f":"IF($C477=\"\",\"\",MAX($A$3:INDIRECT(\"A\" & TEXT(ROW()-1,\"@\")))+1)","v":475},"Y","シート③④","K",45,null,"","","",null,null,102,null,null,null,null,null,null,null,null,null,null,"","",null,""]
[{"$f":"IF($C478=\"\",\"\",MAX($A$3:INDIRECT(\"A\" & TEXT(ROW()-1,\"@\")))+1)","v":476},"Y","シート③④","K",46,null,"","","",null,null,102,null,null,null,null,null,null,null,null,null,null,"","",null,""]
[{"$f":"IF($C479=\"\",\"\",MAX($A$3:INDIRECT(\"A\" & TEXT(ROW()-1,\"@\")))+1)","v":477},"Y","シート③④","K",47,null,"","","",null,null,102,null,null,null,null,null,null,null,null,null,null,"","",null,""]
[{"$f":"IF($C480=\"\",\"\",MAX($A$3:INDIRECT(\"A\" & TEXT(ROW()-1,\"@\")))+1)","v":478},"Y","シート③④","K",48,null,"","","",null,null,102,null,null,null,null,null,null,null,null,null,null,"","",null,""]
[{"$f":"IF($C481=\"\",\"\",MAX($A$3:INDIRECT(\"A\" & TEXT(ROW()-1,\"@\")))+1)","v":479},"Y","シート③④","K",49,null,"","","",null,null,102,null,null,null,null,null,null,null,null,null,null,"","",null,""]
[{"$f":"IF($C482=\"\",\"\",MAX($A$3:INDIRECT(\"A\" & TEXT(ROW()-1,\"@\")))+1)","v":480},"Y","シート③④","K",50,null,"","","",null,null,102,null,null,null,null,null,null,null,null,null,null,"","",null,""]
[{"$f":"IF($C483=\"\",\"\",MAX($A$3:INDIRECT(\"A\" & TEXT(ROW()-1,\"@\")))+1)","v":481},"Y","シート③④","K",51,null,"","","",null,null,102,null,null,null,null,null,null,null,null,null,null,"","",null,""]
[{"$f":"IF($C484=\"\",\"\",MAX($A$3:INDIRECT(\"A\" & TEXT(ROW()-1,\"@\")))+1)","v":482},"Y","シート③④","K",52,null,"","","",null,null,102,null,null,null,null,null,null,null,null,null,null,"","",null,""]
[{"$f":"IF($C485=\"\",\"\",MAX($A$3:INDIRECT(\"A\" & TEXT(ROW()-1,\"@\")))+1)","v":483},"Y","シート③④","K",53,null,"","","",null,null,102,null,null,null,null,null,null,null,null,null,null,"","",null,""]
[{"$f":"IF($C486=\"\",\"\",MAX($A$3:INDIRECT(\"A\" & TEXT(ROW()-1,\"@\")))+1)","v":484},"Y","シート③④","K",54,null,"","","",null,null,102,null,null,null,null,null,null,null,null,null,null,"","",null,""]
[{"$f":"IF($C487=\"\",\"\",MAX($A$3:INDIRECT(\"A\" & TEXT(ROW()-1,\"@\")))+1)","v":485},"Y","シート③④","K",55,null,"","","",null,null,102,null,null,null,null,null,null,null,null,null,null,"","",null,""]
[{"$f":"IF($C488=\"\",\"\",MAX($A$3:INDIRECT(\"A\" & TEXT(ROW()-1,\"@\")))+1)","v":486},"Y","シート③④","K",56,null,"","","",null,null,102,null,null,null,null,null,null,null,null,null,null,"","",null,""]
[{"$f":"IF($C489=\"\",\"\",MAX($A$3:INDIRECT(\"A\" & TEXT(ROW()-1,\"@\")))+1)","v":487},"Y","シート③④","K",57,null,"","","",null,null,102,null,null,null,null,null,null,null,null,null,null,"","",null,""]
[{"$f":"IF($C490=\"\",\"\",MAX($A$3:INDIRECT(\"A\" & TEXT(ROW()-1,\"@\")))+1)","v":488},"Y","シート③④","K",58,null,"","","",null,null,102,null,null,null,null,null,null,null,null,null,null,"","",null,""]
[{"$f":"IF($C491=\"\",\"\",MAX($A$3:INDIRECT(\"A\" & TEXT(ROW()-1,\"@\")))+1)","v":489},"Y","シート③④","K",59,null,"","","",null,null,102,null,null,null,null,null,null,null,null,null,null,"","",null,""]
[{"$f":"IF($C492=\"\",\"\",MAX($A$3:INDIRECT(\"A\" & TEXT(ROW()-1,\"@\")))+1)","v":490},"Y","シート③④","K",60,null,"","","",null,null,102,null,null,null,null,null,null,null,null,null,null,"","",null,""]
[{"$f":"IF($C493=\"\",\"\",MAX($A$3:INDIRECT(\"A\" & TEXT(ROW()-1,\"@\")))+1)","v":491},"Y","シート③④","K",61,null,"","","",null,null,102,null,null,null,null,null,null,null,null,null,null,"","",null,""]
[{"$f":"IF($C494=\"\",\"\",MAX($A$3:INDIRECT(\"A\" & TEXT(ROW()-1,\"@\")))+1)","v":492},"Y","シート③④","K",62,null,"","","",null,null,102,null,null,null,null,null,null,null,null,null,null,"","",null,""]
[{"$f":"IF($C495=\"\",\"\",MAX($A$3:INDIRECT(\"A\" & TEXT(ROW()-1,\"@\")))+1)","v":493},"Y","シート③④","K",63,null,"","","",null,null,102,null,null,null,null,null,null,null,null,null,null,"","",null,""]
[{"$f":"IF($C496=\"\",\"\",MAX($A$3:INDIRECT(\"A\" & TEXT(ROW()-1,\"@\")))+1)","v":494},"Y","シート③④","K",73,null,"","","",null,null,102,null,null,null,null,null,null,null,null,null,null,"","",null,""]
[{"$f":"IF($C497=\"\",\"\",MAX($A$3:INDIRECT(\"A\" & TEXT(ROW()-1,\"@\")))+1)","v":495},"Y","シート③④","K",74,null,"","","",null,null,102,null,null,null,null,null,null,null,null,null,null,"","",null,""]
[{"$f":"IF($C498=\"\",\"\",MAX($A$3:INDIRECT(\"A\" & TEXT(ROW()-1,\"@\")))+1)","v":496},"Y","シート③④","K",75,null,"","","",null,null,102,null,null,null,null,null,null,null,null,null,null,"","",null,""]
[{"$f":"IF($C499=\"\",\"\",MAX($A$3:INDIRECT(\"A\" & TEXT(ROW()-1,\"@\")))+1)","v":497},"Y","シート③④","K",76,null,"","","",null,null,102,null,null,null,null,null,null,null,null,null,null,"","",null,""]
[{"$f":"IF($C500=\"\",\"\",MAX($A$3:INDIRECT(\"A\" & TEXT(ROW()-1,\"@\")))+1)","v":498},"Y","シート③④","K",77,null,"","","",null,null,102,null,null,null,null,null,null,null,null,null,null,"","",null,""]
[{"$f":"IF($C501=\"\",\"\",MAX($A$3:INDIRECT(\"A\" & TEXT(ROW()-1,\"@\")))+1)","v":499},"Y","シート③④","K",78,null,"","","",null,null,102,null,null,null,null,null,null,null,null,null,null,"","",null,""]
[{"$f":"IF($C502=\"\",\"\",MAX($A$3:INDIRECT(\"A\" & TEXT(ROW()-1,\"@\")))+1)","v":500},"Y","シート③④","K",79,null,"","","",null,null,102,null,null,null,null,null,null,null,null,null,null,"","",null,""]
[{"$f":"IF($C503=\"\",\"\",MAX($A$3:INDIRECT(\"A\" & TEXT(ROW()-1,\"@\")))+1)","v":501},"Y","シート③④","K",80,null,"","","",null,null,102,null,null,null,null,null,null,null,null,null,null,"","",null,""]
[{"$f":"IF($C504=\"\",\"\",MAX($A$3:INDIRECT(\"A\" & TEXT(ROW()-1,\"@\")))+1)","v":502},"Y","シート③④","K",81,null,"","","",null,null,102,null,null,null,null,null,null,null,null,null,null,"","",null,""]
[{"$f":"IF($C505=\"\",\"\",MAX($A$3:INDIRECT(\"A\" & TEXT(ROW()-1,\"@\")))+1)","v":503},"Y","シート③④","K",82,null,"","","",null,null,102,null,null,null,null,null,null,null,null,null,null,"","",null,""]
[{"$f":"IF($C506=\"\",\"\",MAX($A$3:INDIRECT(\"A\" & TEXT(ROW()-1,\"@\")))+1)","v":504},"Y","シート③④","K",83,null,"","","",null,null,102,null,null,null,null,null,null,null,null,null,null,"","",null,""]
[{"$f":"IF($C507=\"\",\"\",MAX($A$3:INDIRECT(\"A\" & TEXT(ROW()-1,\"@\")))+1)","v":505},"Y","シート③④","K",84,null,"","","",null,null,102,null,null,null,null,null,null,null,null,null,null,"","",null,""]
[{"$f":"IF($C508=\"\",\"\",MAX($A$3:INDIRECT(\"A\" & TEXT(ROW()-1,\"@\")))+1)","v":506},"Y","シート③④","K",85,null,"","","",null,null,102,null,null,null,null,null,null,null,null,null,null,"","",null,""]
[{"$f":"IF($C509=\"\",\"\",MAX($A$3:INDIRECT(\"A\" & TEXT(ROW()-1,\"@\")))+1)","v":507},"Y","シート③④","K",86,null,"","","",null,null,102,null,null,null,null,null,null,null,null,null,null,"","",null,""]
[{"$f":"IF($C510=\"\",\"\",MAX($A$3:INDIRECT(\"A\" & TEXT(ROW()-1,\"@\")))+1)","v":508},"Y","シート③④","K",87,null,"","","",null,null,102,null,null,null,null,null,null,null,null,null,null,"","",null,""]
[{"$f":"IF($C511=\"\",\"\",MAX($A$3:INDIRECT(\"A\" & TEXT(ROW()-1,\"@\")))+1)","v":509},"Y","シート③④","K",88,null,"","","",null,null,102,null,null,null,null,null,null,null,null,null,null,"","",null,""]
[{"$f":"IF($C512=\"\",\"\",MAX($A$3:INDIRECT(\"A\" & TEXT(ROW()-1,\"@\")))+1)","v":510},"Y","シート③④","K",89,null,"","","",null,null,102,null,null,null,null,null,null,null,null,null,null,"","",null,""]
[{"$f":"IF($C513=\"\",\"\",MAX($A$3:INDIRECT(\"A\" & TEXT(ROW()-1,\"@\")))+1)","v":511},"Y","シート③④","K",90,null,"","","",null,null,102,null,null,null,null,null,null,null,null,null,null,"","",null,""]
[{"$f":"IF($C514=\"\",\"\",MAX($A$3:INDIRECT(\"A\" & TEXT(ROW()-1,\"@\")))+1)","v":512},"Y","シート③④","K",91,null,"","","",null,null,102,null,null,null,null,null,null,null,null,null,null,"","",null,""]
[{"$f":"IF($C515=\"\",\"\",MAX($A$3:INDIRECT(\"A\" & TEXT(ROW()-1,\"@\")))+1)","v":513},"Y","シート③④","K",92,null,"","","",null,null,102,null,null,null,null,null,null,null,null,null,null,{"$f":"IF(AND($B515=\"\",0<COUNTA($J515:$V515)),\"?\",\"\")","v":""},"",null,""]
[{"$f":"IF($C516=\"\",\"\",MAX($A$3:INDIRECT(\"A\" & TEXT(ROW()-1,\"@\")))+1)","v":514},"Y","シート③④","K",93,null,{"$f":"IFERROR(IF(ISBLANK(INDIRECT($C516 & \"!\" & $D516 & $E516)),\"\",INDIRECT($C516 & \"!\" & $D516 & $E516)),\"\")","v":""},"",{"$f":"IF($F516<>$H516,\"D\",\"\")","v":""},null,null,102,null,null,null,null,null,null,null,null,null,null,"",{"$f":"IF(AND($B516<>\"\",OR($C516=\"\",$D516=\"\",$E516=\"\")),\"?\",\"\")","v":""},null,""]
[{"$f":"IF($C517=\"\",\"\",MAX($A$3:INDIRECT(\"A\" & TEXT(ROW()-1,\"@\")))+1)","v":515},"Y","シート③④","K",94,null,"","","",null,null,102,null,null,null,null,null,null,null,null,null,null,"","",null,{"$f":"IF(AND($H517<>\"\",$Y517<>\"\"),$H517,\"\")","v":""}]
[{"$f":"IF($C518=\"\",\"\",MAX($A$3:INDIRECT(\"A\" & TEXT(ROW()-1,\"@\")))+1)","v":516},"Y","シート③④","K",95,null,"",{"$f":"IF(AND($B518<>\"\",$G518<>\"\"),$G518,\"\")","v":""},"",null,null,102,null,null,null,null,null,null,null,null,null,null,"","",null,""]
[{"$f":"IF($C519=\"\",\"\",MAX($A$3:INDIRECT(\"A\" & TEXT(ROW()-1,\"@\")))+1)","v":517},"Y","シート③④","K",96,null,"","","",null,null,102,null,null,null,null,null,null,null,null,null,null,"","",null,""]
[{"$f":"IF($C520=\"\",\"\",MAX($A$3:INDIRECT(\"A\" & TEXT(ROW()-1,\"@\")))+1)","v":518},"Y","シート③④","K",97,null,"","","",null,null,102,null,null,null,null,null,null,null,null,null,null,"","",null,""]
[{"$f":"IF($C521=\"\",\"\",MAX($A$3:INDIRECT(\"A\" & TEXT(ROW()-1,\"@\")))+1)","v":519},"Y","シート③④","K",98,null,"","","",null,null,102,null,null,null,null,null,null,null,null,null,null,"","",null,""]
[{"$f":"IF($C522=\"\",\"\",MAX($A$3:INDIRECT(\"A\" & TEXT(ROW()-1,\"@\")))+1)","v":520},"Y","シート③④","K",99,null,"","","",null,null,102,null,null,null,null,null,null,null,null,null,null,"","",null,""]
[{"$f":"IF($C523=\"\",\"\",MAX($A$3:INDIRECT(\"A\" & TEXT(ROW()-1,\"@\")))+1)","v":521},"Y","シート③④","K",100,null,"","","",null,null,102,null,null,null,null,null,null,null,null,null,null,"","",null,""]
[{"$f":"IF($C524=\"\",\"\",MAX($A$3:INDIRECT(\"A\" & TEXT(ROW()-1,\"@\")))+1)","v":522},"Y","シート③④","K",101,null,"","","",null,null,102,null,null,null,null,null,null,null,null,null,null,"","",null,""]
[{"$f":"IF($C525=\"\",\"\",MAX($A$3:INDIRECT(\"A\" & TEXT(ROW()-1,\"@\")))+1)","v":523},"Y","シート③④","K",102,null,"","","",null,null,102,null,null,null,null,null,null,null,null,null,null,"","",null,""]
[{"$f":"IF($C526=\"\",\"\",MAX($A$3:INDIRECT(\"A\" & TEXT(ROW()-1,\"@\")))+1)","v":524},"Y","シート⑤","E",10,null,"有","有","D","Y",null,2,null,null,null,null,null,null,null,null,null,null,"","","Y","有","crack_flg"]
[{"$f":"IF($C527=\"\",\"\",MAX($A$3:INDIRECT(\"A\" & TEXT(ROW()-1,\"@\")))+1)","v":525},"Y","シート⑥","E",11,null,"正面","正面","D",null,null,5,null,null,null,null,null,null,null,null,null,null,"","",null,""]
[{"$f":"IF($C528=\"\",\"\",MAX($A$3:INDIRECT(\"A\" & TEXT(ROW()-1,\"@\")))+1)","v":526},"Y","シート⑥","F",11,null,"","","",null,null,5,null,null,null,null,null,null,null,null,null,null,"","",null,""]
[{"$f":"IF($C529=\"\",\"\",MAX($A$3:INDIRECT(\"A\" & TEXT(ROW()-1,\"@\")))+1)","v":527},"Y","シート⑥","G",11,null,"","","",null,null,5,null,null,null,null,null,null,null,null,null,null,"","",null,""]
[{"$f":"IF($C530=\"\",\"\",MAX($A$3:INDIRECT(\"A\" & TEXT(ROW()-1,\"@\")))+1)","v":528},"Y","シート⑥","H",11,null,"","","",null,null,5,null,null,null,null,null,null,null,null,null,null,"","",null,""]
[{"$f":"IF($C531=\"\",\"\",MAX($A$3:INDIRECT(\"A\" & TEXT(ROW()-1,\"@\")))+1)","v":529},"Y","シート⑥","I",11,null,"","","",null,null,5,null,null,null,null,null,null,null,null,null,null,"","",null,""]
[{"$f":"IF($C532=\"\",\"\",MAX($A$3:INDIRECT(\"A\" & TEXT(ROW()-1,\"@\")))+1)","v":530},"Y","シート⑥","J",11,null,"","","",null,null,5,null,null,null,null,null,null,null,null,null,null,"","",null,""]
[{"$f":"IF($C533=\"\",\"\",MAX($A$3:INDIRECT(\"A\" & TEXT(ROW()-1,\"@\")))+1)","v":531},"Y","シート⑥","K",11,null,"","","",null,null,5,null,null,null,null,null,null,null,null,null,null,"","",null,""]
[{"$f":"IF($C534=\"\",\"\",MAX($A$3:INDIRECT(\"A\" & TEXT(ROW()-1,\"@\")))+1)","v":532},"Y","シート⑥","L",11,null,"","","",null,null,5,null,null,null,null,null,null,null,null,null,null,"","",null,""]
[{"$f":"IF($C535=\"\",\"\",MAX($A$3:INDIRECT(\"A\" & TEXT(ROW()-1,\"@\")))+1)","v":533},"Y","シート⑥","M",11,null,"","","",null,null,5,null,null,null,null,null,null,null,null,null,null,"","",null,""]
[{"$f":"IF($C536=\"\",\"\",MAX($A$3:INDIRECT(\"A\" & TEXT(ROW()-1,\"@\")))+1)","v":534},"Y","シート⑥","N",11,null,"","","",null,null,5,null,null,null,null,null,null,null,null,null,null,"","",null,""]
[{"$f":"IF($C537=\"\",\"\",MAX($A$3:INDIRECT(\"A\" & TEXT(ROW()-1,\"@\")))+1)","v":535},"Y","シート⑥","O",11,null,"","","",null,null,5,null,null,null,null,null,null,null,null,null,null,"","",null,""]
[{"$f":"IF($C538=\"\",\"\",MAX($A$3:INDIRECT(\"A\" & TEXT(ROW()-1,\"@\")))+1)","v":536},"Y","シート⑥","E",12,null,"貫通","貫通","D",null,null,5,null,null,null,null,null,null,null,null,null,null,"","",null,""]
[{"$f":"IF($C539=\"\",\"\",MAX($A$3:INDIRECT(\"A\" & TEXT(ROW()-1,\"@\")))+1)","v":537},"Y","シート⑥","F",12,null,"","","",null,null,5,null,null,null,null,null,null,null,null,null,null,"","",null,""]
[{"$f":"IF($C540=\"\",\"\",MAX($A$3:INDIRECT(\"A\" & TEXT(ROW()-1,\"@\")))+1)","v":538},"Y","シート⑥","G",12,null,"","","",null,null,5,null,null,null,null,null,null,null,null,null,null,"","",null,""]
[{"$f":"IF($C541=\"\",\"\",MAX($A$3:INDIRECT(\"A\" & TEXT(ROW()-1,\"@\")))+1)","v":539},"Y","シート⑥","H",12,null,"","","",null,null,5,null,null,null,null,null,null,null,null,null,null,"","",null,""]
[{"$f":"IF($C542=\"\",\"\",MAX($A$3:INDIRECT(\"A\" & TEXT(ROW()-1,\"@\")))+1)","v":540},"Y","シート⑥","I",12,null,"","","",null,null,5,null,null,null,null,null,null,null,null,null,null,"","",null,""]
[{"$f":"IF($C543=\"\",\"\",MAX($A$3:INDIRECT(\"A\" & TEXT(ROW()-1,\"@\")))+1)","v":541},"Y","シート⑥","J",12,null,"","","",null,null,5,null,null,null,null,null,null,null,null,null,null,"","",null,""]
[{"$f":"IF($C544=\"\",\"\",MAX($A$3:INDIRECT(\"A\" & TEXT(ROW()-1,\"@\")))+1)","v":542},"Y","シート⑥","K",12,null,"","","",null,null,5,null,null,null,null,null,null,null,null,null,null,"","",null,""]
[{"$f":"IF($C545=\"\",\"\",MAX($A$3:INDIRECT(\"A\" & TEXT(ROW()-1,\"@\")))+1)","v":543},"Y","シート⑥","L",12,null,"","","",null,null,5,null,null,null,null,null,null,null,null,null,null,"","",null,""]
[{"$f":"IF($C546=\"\",\"\",MAX($A$3:INDIRECT(\"A\" & TEXT(ROW()-1,\"@\")))+1)","v":544},"Y","シート⑥","M",12,null,"","","",null,null,5,null,null,null,null,null,null,null,null,null,null,"","",null,""]
[{"$f":"IF($C547=\"\",\"\",MAX($A$3:INDIRECT(\"A\" & TEXT(ROW()-1,\"@\")))+1)","v":545},"Y","シート⑥","N",12,null,"","","",null,null,5,null,null,null,null,null,null,null,null,null,null,"","",null,""]
[{"$f":"IF($C548=\"\",\"\",MAX($A$3:INDIRECT(\"A\" & TEXT(ROW()-1,\"@\")))+1)","v":546},"Y","シート⑥","O",12,null,"","","",null,null,5,null,null,null,null,null,null,null,null,null,null,"","",null,""]
[{"$f":"IF($C549=\"\",\"\",MAX($A$3:INDIRECT(\"A\" & TEXT(ROW()-1,\"@\")))+1)","v":547},"Y","シート⑥","E",13,null,"鉛直","鉛直","D",null,null,5,null,null,null,null,null,null,null,null,null,null,"","",null,""]
[{"$f":"IF($C550=\"\",\"\",MAX($A$3:INDIRECT(\"A\" & TEXT(ROW()-1,\"@\")))+1)","v":548},"Y","シート⑥","F",13,null,"","","",null,null,5,null,null,null,null,null,null,null,null,null,null,"","",null,""]
[{"$f":"IF($C551=\"\",\"\",MAX($A$3:INDIRECT(\"A\" & TEXT(ROW()-1,\"@\")))+1)","v":549},"Y","シート⑥","G",13,null,"","","",null,null,5,null,null,null,null,null,null,null,null,null,null,"","",null,""]
[{"$f":"IF($C552=\"\",\"\",MAX($A$3:INDIRECT(\"A\" & TEXT(ROW()-1,\"@\")))+1)","v":550},"Y","シート⑥","H",13,null,"","","",null,null,5,null,null,null,null,null,null,null,null,null,null,"","",null,""]
[{"$f":"IF($C553=\"\",\"\",MAX($A$3:INDIRECT(\"A\" & TEXT(ROW()-1,\"@\")))+1)","v":551},"Y","シート⑥","I",13,null,"","","",null,null,5,null,null,null,null,null,null,null,null,null,null,"","",null,""]
[{"$f":"IF($C554=\"\",\"\",MAX($A$3:INDIRECT(\"A\" & TEXT(ROW()-1,\"@\")))+1)","v":552},"Y","シート⑥","J",13,null,"","","",null,null,5,null,null,null,null,null,null,null,null,null,null,"","",null,""]
[{"$f":"IF($C555=\"\",\"\",MAX($A$3:INDIRECT(\"A\" & TEXT(ROW()-1,\"@\")))+1)","v":553},"Y","シート⑥","K",13,null,"","","",null,null,5,null,null,null,null,null,null,null,null,null,null,"","",null,""]
[{"$f":"IF($C556=\"\",\"\",MAX($A$3:INDIRECT(\"A\" & TEXT(ROW()-1,\"@\")))+1)","v":554},"Y","シート⑥","L",13,null,"","","",null,null,5,null,null,null,null,null,null,null,null,null,null,"","",null,""]
[{"$f":"IF($C557=\"\",\"\",MAX($A$3:INDIRECT(\"A\" & TEXT(ROW()-1,\"@\")))+1)","v":555},"Y","シート⑥","M",13,null,"","","",null,null,5,null,null,null,null,null,null,null,null,null,null,"","",null,""]
[{"$f":"IF($C558=\"\",\"\",MAX($A$3:INDIRECT(\"A\" & TEXT(ROW()-1,\"@\")))+1)","v":556},"Y","シート⑥","N",13,null,"","","",null,null,5,null,null,null,null,null,null,null,null,null,null,"","",null,""]
[{"$f":"IF($C559=\"\",\"\",MAX($A$3:INDIRECT(\"A\" & TEXT(ROW()-1,\"@\")))+1)","v":557},"Y","シート⑥","O",13,null,"","","",null,null,5,null,null,null,null,null,null,null,null,null,null,"","",null,""]
[{"$f":"IF($C560=\"\",\"\",MAX($A$3:INDIRECT(\"A\" & TEXT(ROW()-1,\"@\")))+1)","v":558},"Y","シート⑥","C",14,null,42891,42891,"D",null,null,null,"DATE",null,null,null,null,null,null,null,null,null,"","",null,""]
[{"$f":"IF($C561=\"\",\"\",MAX($A$3:INDIRECT(\"A\" & TEXT(ROW()-1,\"@\")))+1)","v":559},"Y","シート⑥","E",14,null,0.15,0.15,"D",null,"N",null,null,"AB",0,1000,"R",{"$f":"A560","v":558},null,null,null,null,"","",null,""]
[{"$f":"IF($C562=\"\",\"\",MAX($A$3:INDIRECT(\"A\" & TEXT(ROW()-1,\"@\")))+1)","v":560},"Y","シート⑥","F",14,null,"","","",null,"N",null,null,"AB",0,1000,"R",{"$f":"A560","v":558},null,null,null,null,"","",null,""]
[{"$f":"IF($C563=\"\",\"\",MAX($A$3:INDIRECT(\"A\" & TEXT(ROW()-1,\"@\")))+1)","v":561},"Y","シート⑥","G",14,null,"","","",null,"N",null,null,"AB",0,1000,"R",{"$f":"A560","v":558},null,null,null,null,"","",null,""]
[{"$f":"IF($C564=\"\",\"\",MAX($A$3:INDIRECT(\"A\" & TEXT(ROW()-1,\"@\")))+1)","v":562},"Y","シート⑥","H",14,null,"","","",null,"N",null,null,"AB",0,1000,"R",{"$f":"A560","v":558},null,null,null,null,"","",null,""]
[{"$f":"IF($C565=\"\",\"\",MAX($A$3:INDIRECT(\"A\" & TEXT(ROW()-1,\"@\")))+1)","v":563},"Y","シート⑥","I",14,null,"","","",null,"N",null,null,"AB",0,1000,"R",{"$f":"A560","v":558},null,null,null,null,"","",null,""]
[{"$f":"IF($C566=\"\",\"\",MAX($A$3:INDIRECT(\"A\" & TEXT(ROW()-1,\"@\")))+1)","v":564},"Y","シート⑥","J",14,null,"","","",null,"N",null,null,"AB",0,1000,"R",{"$f":"A560","v":558},null,null,null,null,"","",null,""]
[{"$f":"IF($C567=\"\",\"\",MAX($A$3:INDIRECT(\"A\" & TEXT(ROW()-1,\"@\")))+1)","v":565},"Y","シート⑥","K",14,null,"","","",null,"N",null,null,"AB",0,1000,"R",{"$f":"A560","v":558},null,null,null,null,"","",null,""]
[{"$f":"IF($C568=\"\",\"\",MAX($A$3:INDIRECT(\"A\" & TEXT(ROW()-1,\"@\")))+1)","v":566},"Y","シート⑥","L",14,null,"","","",null,"N",null,null,"AB",0,1000,"R",{"$f":"A560","v":558},null,null,null,null,"","",null,""]
[{"$f":"IF($C569=\"\",\"\",MAX($A$3:INDIRECT(\"A\" & TEXT(ROW()-1,\"@\")))+1)","v":567},"Y","シート⑥","M",14,null,"","","",null,"N",null,null,"AB",0,1000,"R",{"$f":"A560","v":558},null,null,null,null,"","",null,""]
[{"$f":"IF($C570=\"\",\"\",MAX($A$3:INDIRECT(\"A\" & TEXT(ROW()-1,\"@\")))+1)","v":568},"Y","シート⑥","N",14,null,"","","",null,"N",null,null,"AB",0,1000,"R",{"$f":"A560","v":558},null,null,null,null,"","",null,""]
[{"$f":"IF($C571=\"\",\"\",MAX($A$3:INDIRECT(\"A\" & TEXT(ROW()-1,\"@\")))+1)","v":569},"Y","シート⑥","O",14,null,"","","",null,"N",null,null,"AB",0,1000,"R",{"$f":"A560","v":558},null,null,null,null,"","",null,""]
[{"$f":"IF($C572=\"\",\"\",MAX($A$3:INDIRECT(\"A\" & TEXT(ROW()-1,\"@\")))+1)","v":570},"Y","シート⑥","C",15,null,42898,42898,"D",null,null,null,"DATE",null,null,null,null,null,null,null,null,null,"","",null,""]
[{"$f":"IF($C573=\"\",\"\",MAX($A$3:INDIRECT(\"A\" & TEXT(ROW()-1,\"@\")))+1)","v":571},"Y","シート⑥","E",15,null,0.15,0.15,"D",null,"N",null,null,"AB",0,1000,"R",{"$f":"A572","v":570},null,null,null,null,"","",null,""]
[{"$f":"IF($C574=\"\",\"\",MAX($A$3:INDIRECT(\"A\" & TEXT(ROW()-1,\"@\")))+1)","v":572},"Y","シート⑥","F",15,null,"","","",null,"N",null,null,"AB",0,1000,"R",{"$f":"A572","v":570},null,null,null,null,"","",null,""]
[{"$f":"IF($C575=\"\",\"\",MAX($A$3:INDIRECT(\"A\" & TEXT(ROW()-1,\"@\")))+1)","v":573},"Y","シート⑥","G",15,null,"","","",null,"N",null,null,"AB",0,1000,"R",{"$f":"A572","v":570},null,null,null,null,"","",null,""]
[{"$f":"IF($C576=\"\",\"\",MAX($A$3:INDIRECT(\"A\" & TEXT(ROW()-1,\"@\")))+1)","v":574},"Y","シート⑥","H",15,null,"","","",null,"N",null,null,"AB",0,1000,"R",{"$f":"A572","v":570},null,null,null,null,"","",null,""]
[{"$f":"IF($C577=\"\",\"\",MAX($A$3:INDIRECT(\"A\" & TEXT(ROW()-1,\"@\")))+1)","v":575},"Y","シート⑥","I",15,null,"","","",null,"N",null,null,"AB",0,1000,"R",{"$f":"A572","v":570},null,null,null,null,"","",null,""]
[{"$f":"IF($C578=\"\",\"\",MAX($A$3:INDIRECT(\"A\" & TEXT(ROW()-1,\"@\")))+1)","v":576},"Y","シート⑥","J",15,null,"","","",null,"N",null,null,"AB",0,1000,"R",{"$f":"A572","v":570},null,null,null,null,"","",null,""]
[{"$f":"IF($C579=\"\",\"\",MAX($A$3:INDIRECT(\"A\" & TEXT(ROW()-1,\"@\")))+1)","v":577},"Y","シート⑥","K",15,null,"","","",null,"N",null,null,"AB",0,1000,"R",{"$f":"A572","v":570},null,null,null,null,{"$f":"IF(AND($B579=\"\",0<COUNTA($J579:$V579)),\"?\",\"\")","v":""},"",null,""]
[{"$f":"IF($C580=\"\",\"\",MAX($A$3:INDIRECT(\"A\" & TEXT(ROW()-1,\"@\")))+1)","v":578},"Y","シート⑥","L",15,null,{"$f":"IFERROR(IF(ISBLANK(INDIRECT($C580 & \"!\" & $D580 & $E580)),\"\",INDIRECT($C580 & \"!\" & $D580 & $E580)),\"\")","v":""},"",{"$f":"IF($F580<>$H580,\"D\",\"\")","v":""},null,"N",null,null,"AB",0,1000,"R",{"$f":"A572","v":570},null,null,null,null,"",{"$f":"IF(AND($B580<>\"\",OR($C580=\"\",$D580=\"\",$E580=\"\")),\"?\",\"\")","v":""},null,""]
[{"$f":"IF($C581=\"\",\"\",MAX($A$3:INDIRECT(\"A\" & TEXT(ROW()-1,\"@\")))+1)","v":579},"Y","シート⑥","M",15,null,"","","",null,"N",null,null,"AB",0,1000,"R",{"$f":"A572","v":570},null,null,null,null,"","",null,{"$f":"IF(AND($H581<>\"\",$Y581<>\"\"),$H581,\"\")","v":""}]
[{"$f":"IF($C582=\"\",\"\",MAX($A$3:INDIRECT(\"A\" & TEXT(ROW()-1,\"@\")))+1)","v":580},"Y","シート⑥","N",15,null,"",{"$f":"IF(AND($B582<>\"\",$G582<>\"\"),$G582,\"\")","v":""},"",null,"N",null,null,"AB",0,1000,"R",{"$f":"A572","v":570},null,null,null,null,"","",null,""]
[{"$f":"IF($C583=\"\",\"\",MAX($A$3:INDIRECT(\"A\" & TEXT(ROW()-1,\"@\")))+1)","v":581},"Y","シート⑥","O",15,null,"","","",null,"N",null,null,"AB",0,1000,"R",{"$f":"A572","v":570},null,null,null,null,"","",null,""]
[{"$f":"IF($C584=\"\",\"\",MAX($A$3:INDIRECT(\"A\" & TEXT(ROW()-1,\"@\")))+1)","v":582},"Y","シート⑥","C",16,null,42905,42905,"D",null,null,null,"DATE",null,null,null,null,null,null,null,null,null,"","",null,""]
[{"$f":"IF($C585=\"\",\"\",MAX($A$3:INDIRECT(\"A\" & TEXT(ROW()-1,\"@\")))+1)","v":583},"Y","シート⑥","E",16,null,0.15,0.15,"D",null,"N",null,null,"AB",0,1000,"R",{"$f":"A584","v":582},null,null,null,null,"","",null,""]
[{"$f":"IF($C586=\"\",\"\",MAX($A$3:INDIRECT(\"A\" & TEXT(ROW()-1,\"@\")))+1)","v":584},"Y","シート⑥","F",16,null,"","","",null,"N",null,null,"AB",0,1000,"R",{"$f":"A584","v":582},null,null,null,null,"","",null,""]
[{"$f":"IF($C587=\"\",\"\",MAX($A$3:INDIRECT(\"A\" & TEXT(ROW()-1,\"@\")))+1)","v":585},"Y","シート⑥","G",16,null,"","","",null,"N",null,null,"AB",0,1000,"R",{"$f":"A584","v":582},null,null,null,null,"","",null,""]
[{"$f":"IF($C588=\"\",\"\",MAX($A$3:INDIRECT(\"A\" & TEXT(ROW()-1,\"@\")))+1)","v":586},"Y","シート⑥","H",16,null,"","","",null,"N",null,null,"AB",0,1000,"R",{"$f":"A584","v":582},null,null,null,null,"","",null,""]
[{"$f":"IF($C589=\"\",\"\",MAX($A$3:INDIRECT(\"A\" & TEXT(ROW()-1,\"@\")))+1)","v":587},"Y","シート⑥","I",16,null,"","","",null,"N",null,null,"AB",0,1000,"R",{"$f":"A584","v":582},null,null,null,null,"","",null,""]
[{"$f":"IF($C590=\"\",\"\",MAX($A$3:INDIRECT(\"A\" & TEXT(ROW()-1,\"@\")))+1)","v":588},"Y","シート⑥","J",16,null,"","","",null,"N",null,null,"AB",0,1000,"R",{"$f":"A584","v":582},null,null,null,null,"","",null,""]
[{"$f":"IF($C591=\"\",\"\",MAX($A$3:INDIRECT(\"A\" & TEXT(ROW()-1,\"@\")))+1)","v":589},"Y","シート⑥","K",16,null,"","","",null,"N",null,null,"AB",0,1000,"R",{"$f":"A584","v":582},null,null,null,null,"","",null,""]
[{"$f":"IF($C592=\"\",\"\",MAX($A$3:INDIRECT(\"A\" & TEXT(ROW()-1,\"@\")))+1)","v":590},"Y","シート⑥","L",16,null,"","","",null,"N",null,null,"AB",0,1000,"R",{"$f":"A584","v":582},null,null,null,null,"","",null,""]
[{"$f":"IF($C593=\"\",\"\",MAX($A$3:INDIRECT(\"A\" & TEXT(ROW()-1,\"@\")))+1)","v":591},"Y","シート⑥","M",16,null,"","","",null,"N",null,null,"AB",0,1000,"R",{"$f":"A584","v":582},null,null,null,null,"","",null,""]
[{"$f":"IF($C594=\"\",\"\",MAX($A$3:INDIRECT(\"A\" & TEXT(ROW()-1,\"@\")))+1)","v":592},"Y","シート⑥","N",16,null,"","","",null,"N",null,null,"AB",0,1000,"R",{"$f":"A584","v":582},null,null,null,null,"","",null,""]
[{"$f":"IF($C595=\"\",\"\",MAX($A$3:INDIRECT(\"A\" & TEXT(ROW()-1,\"@\")))+1)","v":593},"Y","シート⑥","O",16,null,"","","",null,"N",null,null,"AB",0,1000,"R",{"$f":"A584","v":582},null,null,null,null,"","",null,""]
[{"$f":"IF($C596=\"\",\"\",MAX($A$3:INDIRECT(\"A\" & TEXT(ROW()-1,\"@\")))+1)","v":594},"Y","シート⑥","C",17,null,42912,42912,"D",null,null,null,"DATE",null,null,null,null,null,null,null,null,null,"","",null,""]
[{"$f":"IF($C597=\"\",\"\",MAX($A$3:INDIRECT(\"A\" & TEXT(ROW()-1,\"@\")))+1)","v":595},"Y","シート⑥","E",17,null,0.2,0.2,"D",null,"N",null,null,"AB",0,1000,"R",{"$f":"A596","v":594},null,null,null,null,"","",null,""]
[{"$f":"IF($C598=\"\",\"\",MAX($A$3:INDIRECT(\"A\" & TEXT(ROW()-1,\"@\")))+1)","v":596},"Y","シート⑥","F",17,null,"","","",null,"N",null,null,"AB",0,1000,"R",{"$f":"A596","v":594},null,null,null,null,"","",null,""]
[{"$f":"IF($C599=\"\",\"\",MAX($A$3:INDIRECT(\"A\" & TEXT(ROW()-1,\"@\")))+1)","v":597},"Y","シート⑥","G",17,null,"","","",null,"N",null,null,"AB",0,1000,"R",{"$f":"A596","v":594},null,null,null,null,"","",null,""]
[{"$f":"IF($C600=\"\",\"\",MAX($A$3:INDIRECT(\"A\" & TEXT(ROW()-1,\"@\")))+1)","v":598},"Y","シート⑥","H",17,null,"","","",null,"N",null,null,"AB",0,1000,"R",{"$f":"A596","v":594},null,null,null,null,"","",null,""]
[{"$f":"IF($C601=\"\",\"\",MAX($A$3:INDIRECT(\"A\" & TEXT(ROW()-1,\"@\")))+1)","v":599},"Y","シート⑥","I",17,null,"","","",null,"N",null,null,"AB",0,1000,"R",{"$f":"A596","v":594},null,null,null,null,"","",null,""]
[{"$f":"IF($C602=\"\",\"\",MAX($A$3:INDIRECT(\"A\" & TEXT(ROW()-1,\"@\")))+1)","v":600},"Y","シート⑥","J",17,null,"","","",null,"N",null,null,"AB",0,1000,"R",{"$f":"A596","v":594},null,null,null,null,"","",null,""]
[{"$f":"IF($C603=\"\",\"\",MAX($A$3:INDIRECT(\"A\" & TEXT(ROW()-1,\"@\")))+1)","v":601},"Y","シート⑥","K",17,null,"","","",null,"N",null,null,"AB",0,1000,"R",{"$f":"A596","v":594},null,null,null,null,"","",null,""]
[{"$f":"IF($C604=\"\",\"\",MAX($A$3:INDIRECT(\"A\" & TEXT(ROW()-1,\"@\")))+1)","v":602},"Y","シート⑥","L",17,null,"","","",null,"N",null,null,"AB",0,1000,"R",{"$f":"A596","v":594},null,null,null,null,"","",null,""]
[{"$f":"IF($C605=\"\",\"\",MAX($A$3:INDIRECT(\"A\" & TEXT(ROW()-1,\"@\")))+1)","v":603},"Y","シート⑥","M",17,null,"","","",null,"N",null,null,"AB",0,1000,"R",{"$f":"A596","v":594},null,null,null,null,"","",null,""]
[{"$f":"IF($C606=\"\",\"\",MAX($A$3:INDIRECT(\"A\" & TEXT(ROW()-1,\"@\")))+1)","v":604},"Y","シート⑥","N",17,null,"","","",null,"N",null,null,"AB",0,1000,"R",{"$f":"A596","v":594},null,null,null,null,"","",null,""]
[{"$f":"IF($C607=\"\",\"\",MAX($A$3:INDIRECT(\"A\" & TEXT(ROW()-1,\"@\")))+1)","v":605},"Y","シート⑥","O",17,null,"","","",null,"N",null,null,"AB",0,1000,"R",{"$f":"A596","v":594},null,null,null,null,"","",null,""]
[{"$f":"IF($C608=\"\",\"\",MAX($A$3:INDIRECT(\"A\" & TEXT(ROW()-1,\"@\")))+1)","v":606},"Y","シート⑥","C",18,null,42919,42919,"D",null,null,null,"DATE",null,null,null,null,null,null,null,null,null,"","",null,""]
[{"$f":"IF($C609=\"\",\"\",MAX($A$3:INDIRECT(\"A\" & TEXT(ROW()-1,\"@\")))+1)","v":607},"Y","シート⑥","E",18,null,0.25,0.25,"D",null,"N",null,null,"AB",0,1000,"R",{"$f":"A608","v":606},null,null,null,null,"","",null,""]
[{"$f":"IF($C610=\"\",\"\",MAX($A$3:INDIRECT(\"A\" & TEXT(ROW()-1,\"@\")))+1)","v":608},"Y","シート⑥","F",18,null,"","","",null,"N",null,null,"AB",0,1000,"R",{"$f":"A608","v":606},null,null,null,null,"","",null,""]
[{"$f":"IF($C611=\"\",\"\",MAX($A$3:INDIRECT(\"A\" & TEXT(ROW()-1,\"@\")))+1)","v":609},"Y","シート⑥","G",18,null,"","","",null,"N",null,null,"AB",0,1000,"R",{"$f":"A608","v":606},null,null,null,null,"","",null,""]
[{"$f":"IF($C612=\"\",\"\",MAX($A$3:INDIRECT(\"A\" & TEXT(ROW()-1,\"@\")))+1)","v":610},"Y","シート⑥","H",18,null,"","","",null,"N",null,null,"AB",0,1000,"R",{"$f":"A608","v":606},null,null,null,null,"","",null,""]
[{"$f":"IF($C613=\"\",\"\",MAX($A$3:INDIRECT(\"A\" & TEXT(ROW()-1,\"@\")))+1)","v":611},"Y","シート⑥","I",18,null,"","","",null,"N",null,null,"AB",0,1000,"R",{"$f":"A608","v":606},null,null,null,null,"","",null,""]
[{"$f":"IF($C614=\"\",\"\",MAX($A$3:INDIRECT(\"A\" & TEXT(ROW()-1,\"@\")))+1)","v":612},"Y","シート⑥","J",18,null,"","","",null,"N",null,null,"AB",0,1000,"R",{"$f":"A608","v":606},null,null,null,null,"","",null,""]
[{"$f":"IF($C615=\"\",\"\",MAX($A$3:INDIRECT(\"A\" & TEXT(ROW()-1,\"@\")))+1)","v":613},"Y","シート⑥","K",18,null,"","","",null,"N",null,null,"AB",0,1000,"R",{"$f":"A608","v":606},null,null,null,null,"","",null,""]
[{"$f":"IF($C616=\"\",\"\",MAX($A$3:INDIRECT(\"A\" & TEXT(ROW()-1,\"@\")))+1)","v":614},"Y","シート⑥","L",18,null,"","","",null,"N",null,null,"AB",0,1000,"R",{"$f":"A608","v":606},null,null,null,null,"","",null,""]
[{"$f":"IF($C617=\"\",\"\",MAX($A$3:INDIRECT(\"A\" & TEXT(ROW()-1,\"@\")))+1)","v":615},"Y","シート⑥","M",18,null,"","","",null,"N",null,null,"AB",0,1000,"R",{"$f":"A608","v":606},null,null,null,null,"","",null,""]
[{"$f":"IF($C618=\"\",\"\",MAX($A$3:INDIRECT(\"A\" & TEXT(ROW()-1,\"@\")))+1)","v":616},"Y","シート⑥","N",18,null,"","","",null,"N",null,null,"AB",0,1000,"R",{"$f":"A608","v":606},null,null,null,null,"","",null,""]
[{"$f":"IF($C619=\"\",\"\",MAX($A$3:INDIRECT(\"A\" & TEXT(ROW()-1,\"@\")))+1)","v":617},"Y","シート⑥","O",18,null,"","","",null,"N",null,null,"AB",0,1000,"R",{"$f":"A608","v":606},null,null,null,null,"","",null,""]
[{"$f":"IF($C620=\"\",\"\",MAX($A$3:INDIRECT(\"A\" & TEXT(ROW()-1,\"@\")))+1)","v":618},"Y","シート⑥","C",19,null,"","","",null,null,null,"DATE",null,null,null,null,null,null,null,null,null,"","",null,""]
[{"$f":"IF($C621=\"\",\"\",MAX($A$3:INDIRECT(\"A\" & TEXT(ROW()-1,\"@\")))+1)","v":619},"Y","シート⑥","E",19,null,"","","",null,"N",null,null,"AB",0,1000,"R",{"$f":"A620","v":618},null,null,null,null,"","",null,""]
[{"$f":"IF($C622=\"\",\"\",MAX($A$3:INDIRECT(\"A\" & TEXT(ROW()-1,\"@\")))+1)","v":620},"Y","シート⑥","F",19,null,"","","",null,"N",null,null,"AB",0,1000,"R",{"$f":"A620","v":618},null,null,null,null,"","",null,""]
[{"$f":"IF($C623=\"\",\"\",MAX($A$3:INDIRECT(\"A\" & TEXT(ROW()-1,\"@\")))+1)","v":621},"Y","シート⑥","G",19,null,"","","",null,"N",null,null,"AB",0,1000,"R",{"$f":"A620","v":618},null,null,null,null,"","",null,""]
[{"$f":"IF($C624=\"\",\"\",MAX($A$3:INDIRECT(\"A\" & TEXT(ROW()-1,\"@\")))+1)","v":622},"Y","シート⑥","H",19,null,"","","",null,"N",null,null,"AB",0,1000,"R",{"$f":"A620","v":618},null,null,null,null,"","",null,""]
[{"$f":"IF($C625=\"\",\"\",MAX($A$3:INDIRECT(\"A\" & TEXT(ROW()-1,\"@\")))+1)","v":623},"Y","シート⑥","I",19,null,"","","",null,"N",null,null,"AB",0,1000,"R",{"$f":"A620","v":618},null,null,null,null,"","",null,""]
[{"$f":"IF($C626=\"\",\"\",MAX($A$3:INDIRECT(\"A\" & TEXT(ROW()-1,\"@\")))+1)","v":624},"Y","シート⑥","J",19,null,"","","",null,"N",null,null,"AB",0,1000,"R",{"$f":"A620","v":618},null,null,null,null,"","",null,""]
[{"$f":"IF($C627=\"\",\"\",MAX($A$3:INDIRECT(\"A\" & TEXT(ROW()-1,\"@\")))+1)","v":625},"Y","シート⑥","K",19,null,"","","",null,"N",null,null,"AB",0,1000,"R",{"$f":"A620","v":618},null,null,null,null,"","",null,""]
[{"$f":"IF($C628=\"\",\"\",MAX($A$3:INDIRECT(\"A\" & TEXT(ROW()-1,\"@\")))+1)","v":626},"Y","シート⑥","L",19,null,"","","",null,"N",null,null,"AB",0,1000,"R",{"$f":"A620","v":618},null,null,null,null,"","",null,""]
[{"$f":"IF($C629=\"\",\"\",MAX($A$3:INDIRECT(\"A\" & TEXT(ROW()-1,\"@\")))+1)","v":627},"Y","シート⑥","M",19,null,"","","",null,"N",null,null,"AB",0,1000,"R",{"$f":"A620","v":618},null,null,null,null,"","",null,""]
[{"$f":"IF($C630=\"\",\"\",MAX($A$3:INDIRECT(\"A\" & TEXT(ROW()-1,\"@\")))+1)","v":628},"Y","シート⑥","N",19,null,"","","",null,"N",null,null,"AB",0,1000,"R",{"$f":"A620","v":618},null,null,null,null,"","",null,""]
[{"$f":"IF($C631=\"\",\"\",MAX($A$3:INDIRECT(\"A\" & TEXT(ROW()-1,\"@\")))+1)","v":629},"Y","シート⑥","O",19,null,"","","",null,"N",null,null,"AB",0,1000,"R",{"$f":"A620","v":618},null,null,null,null,"","",null,""]
[{"$f":"IF($C632=\"\",\"\",MAX($A$3:INDIRECT(\"A\" & TEXT(ROW()-1,\"@\")))+1)","v":630},"Y","シート⑥","C",20,null,"","","",null,null,null,"DATE",null,null,null,null,null,null,null,null,null,"","",null,""]
[{"$f":"IF($C633=\"\",\"\",MAX($A$3:INDIRECT(\"A\" & TEXT(ROW()-1,\"@\")))+1)","v":631},"Y","シート⑥","E",20,null,"","","",null,"N",null,null,"AB",0,1000,"R",{"$f":"A632","v":630},null,null,null,null,"","",null,""]
[{"$f":"IF($C634=\"\",\"\",MAX($A$3:INDIRECT(\"A\" & TEXT(ROW()-1,\"@\")))+1)","v":632},"Y","シート⑥","F",20,null,"","","",null,"N",null,null,"AB",0,1000,"R",{"$f":"A632","v":630},null,null,null,null,"","",null,""]
[{"$f":"IF($C635=\"\",\"\",MAX($A$3:INDIRECT(\"A\" & TEXT(ROW()-1,\"@\")))+1)","v":633},"Y","シート⑥","G",20,null,"","","",null,"N",null,null,"AB",0,1000,"R",{"$f":"A632","v":630},null,null,null,null,"","",null,""]
[{"$f":"IF($C636=\"\",\"\",MAX($A$3:INDIRECT(\"A\" & TEXT(ROW()-1,\"@\")))+1)","v":634},"Y","シート⑥","H",20,null,"","","",null,"N",null,null,"AB",0,1000,"R",{"$f":"A632","v":630},null,null,null,null,"","",null,""]
[{"$f":"IF($C637=\"\",\"\",MAX($A$3:INDIRECT(\"A\" & TEXT(ROW()-1,\"@\")))+1)","v":635},"Y","シート⑥","I",20,null,"","","",null,"N",null,null,"AB",0,1000,"R",{"$f":"A632","v":630},null,null,null,null,"","",null,""]
[{"$f":"IF($C638=\"\",\"\",MAX($A$3:INDIRECT(\"A\" & TEXT(ROW()-1,\"@\")))+1)","v":636},"Y","シート⑥","J",20,null,"","","",null,"N",null,null,"AB",0,1000,"R",{"$f":"A632","v":630},null,null,null,null,"","",null,""]
[{"$f":"IF($C639=\"\",\"\",MAX($A$3:INDIRECT(\"A\" & TEXT(ROW()-1,\"@\")))+1)","v":637},"Y","シート⑥","K",20,null,"","","",null,"N",null,null,"AB",0,1000,"R",{"$f":"A632","v":630},null,null,null,null,"","",null,""]
[{"$f":"IF($C640=\"\",\"\",MAX($A$3:INDIRECT(\"A\" & TEXT(ROW()-1,\"@\")))+1)","v":638},"Y","シート⑥","L",20,null,"","","",null,"N",null,null,"AB",0,1000,"R",{"$f":"A632","v":630},null,null,null,null,"","",null,""]
[{"$f":"IF($C641=\"\",\"\",MAX($A$3:INDIRECT(\"A\" & TEXT(ROW()-1,\"@\")))+1)","v":639},"Y","シート⑥","M",20,null,"","","",null,"N",null,null,"AB",0,1000,"R",{"$f":"A632","v":630},null,null,null,null,"","",null,""]
[{"$f":"IF($C642=\"\",\"\",MAX($A$3:INDIRECT(\"A\" & TEXT(ROW()-1,\"@\")))+1)","v":640},"Y","シート⑥","N",20,null,"","","",null,"N",null,null,"AB",0,1000,"R",{"$f":"A632","v":630},null,null,null,null,"","",null,""]
[{"$f":"IF($C643=\"\",\"\",MAX($A$3:INDIRECT(\"A\" & TEXT(ROW()-1,\"@\")))+1)","v":641},"Y","シート⑥","O",20,null,"","","",null,"N",null,null,"AB",0,1000,"R",{"$f":"A632","v":630},null,null,null,null,{"$f":"IF(AND($B643=\"\",0<COUNTA($J643:$V643)),\"?\",\"\")","v":""},"",null,""]
[{"$f":"IF($C644=\"\",\"\",MAX($A$3:INDIRECT(\"A\" & TEXT(ROW()-1,\"@\")))+1)","v":642},"Y","シート⑥","C",21,null,{"$f":"IFERROR(IF(ISBLANK(INDIRECT($C644 & \"!\" & $D644 & $E644)),\"\",INDIRECT($C644 & \"!\" & $D644 & $E644)),\"\")","v":""},"",{"$f":"IF($F644<>$H644,\"D\",\"\")","v":""},null,null,null,"DATE",null,null,null,null,null,null,null,null,null,"",{"$f":"IF(AND($B644<>\"\",OR($C644=\"\",$D644=\"\",$E644=\"\")),\"?\",\"\")","v":""},null,""]
[{"$f":"IF($C645=\"\",\"\",MAX($A$3:INDIRECT(\"A\" & TEXT(ROW()-1,\"@\")))+1)","v":643},"Y","シート⑥","E",21,null,"","","",null,"N",null,null,"AB",0,1000,"R",{"$f":"A644","v":642},null,null,null,null,"","",null,{"$f":"IF(AND($H645<>\"\",$Y645<>\"\"),$H645,\"\")","v":""}]
[{"$f":"IF($C646=\"\",\"\",MAX($A$3:INDIRECT(\"A\" & TEXT(ROW()-1,\"@\")))+1)","v":644},"Y","シート⑥","F",21,null,"",{"$f":"IF(AND($B646<>\"\",$G646<>\"\"),$G646,\"\")","v":""},"",null,"N",null,null,"AB",0,1000,"R",{"$f":"A644","v":642},null,null,null,null,"","",null,""]
[{"$f":"IF($C647=\"\",\"\",MAX($A$3:INDIRECT(\"A\" & TEXT(ROW()-1,\"@\")))+1)","v":645},"Y","シート⑥","G",21,null,"","","",null,"N",null,null,"AB",0,1000,"R",{"$f":"A644","v":642},null,null,null,null,"","",null,""]
[{"$f":"IF($C648=\"\",\"\",MAX($A$3:INDIRECT(\"A\" & TEXT(ROW()-1,\"@\")))+1)","v":646},"Y","シート⑥","H",21,null,"","","",null,"N",null,null,"AB",0,1000,"R",{"$f":"A644","v":642},null,null,null,null,"","",null,""]
[{"$f":"IF($C649=\"\",\"\",MAX($A$3:INDIRECT(\"A\" & TEXT(ROW()-1,\"@\")))+1)","v":647},"Y","シート⑥","I",21,null,"","","",null,"N",null,null,"AB",0,1000,"R",{"$f":"A644","v":642},null,null,null,null,"","",null,""]
[{"$f":"IF($C650=\"\",\"\",MAX($A$3:INDIRECT(\"A\" & TEXT(ROW()-1,\"@\")))+1)","v":648},"Y","シート⑥","J",21,null,"","","",null,"N",null,null,"AB",0,1000,"R",{"$f":"A644","v":642},null,null,null,null,"","",null,""]
[{"$f":"IF($C651=\"\",\"\",MAX($A$3:INDIRECT(\"A\" & TEXT(ROW()-1,\"@\")))+1)","v":649},"Y","シート⑥","K",21,null,"","","",null,"N",null,null,"AB",0,1000,"R",{"$f":"A644","v":642},null,null,null,null,"","",null,""]
[{"$f":"IF($C652=\"\",\"\",MAX($A$3:INDIRECT(\"A\" & TEXT(ROW()-1,\"@\")))+1)","v":650},"Y","シート⑥","L",21,null,"","","",null,"N",null,null,"AB",0,1000,"R",{"$f":"A644","v":642},null,null,null,null,"","",null,""]
[{"$f":"IF($C653=\"\",\"\",MAX($A$3:INDIRECT(\"A\" & TEXT(ROW()-1,\"@\")))+1)","v":651},"Y","シート⑥","M",21,null,"","","",null,"N",null,null,"AB",0,1000,"R",{"$f":"A644","v":642},null,null,null,null,"","",null,""]
[{"$f":"IF($C654=\"\",\"\",MAX($A$3:INDIRECT(\"A\" & TEXT(ROW()-1,\"@\")))+1)","v":652},"Y","シート⑥","N",21,null,"","","",null,"N",null,null,"AB",0,1000,"R",{"$f":"A644","v":642},null,null,null,null,"","",null,""]
[{"$f":"IF($C655=\"\",\"\",MAX($A$3:INDIRECT(\"A\" & TEXT(ROW()-1,\"@\")))+1)","v":653},"Y","シート⑥","O",21,null,"","","",null,"N",null,null,"AB",0,1000,"R",{"$f":"A644","v":642},null,null,null,null,"","",null,""]
[{"$f":"IF($C656=\"\",\"\",MAX($A$3:INDIRECT(\"A\" & TEXT(ROW()-1,\"@\")))+1)","v":654},"Y","シート⑥","C",22,null,"","","",null,null,null,"DATE",null,null,null,null,null,null,null,null,null,"","",null,""]
[{"$f":"IF($C657=\"\",\"\",MAX($A$3:INDIRECT(\"A\" & TEXT(ROW()-1,\"@\")))+1)","v":655},"Y","シート⑥","E",22,null,"","","",null,"N",null,null,"AB",0,1000,"R",{"$f":"A656","v":654},null,null,null,null,"","",null,""]
[{"$f":"IF($C658=\"\",\"\",MAX($A$3:INDIRECT(\"A\" & TEXT(ROW()-1,\"@\")))+1)","v":656},"Y","シート⑥","F",22,null,"","","",null,"N",null,null,"AB",0,1000,"R",{"$f":"A656","v":654},null,null,null,null,"","",null,""]
[{"$f":"IF($C659=\"\",\"\",MAX($A$3:INDIRECT(\"A\" & TEXT(ROW()-1,\"@\")))+1)","v":657},"Y","シート⑥","G",22,null,"","","",null,"N",null,null,"AB",0,1000,"R",{"$f":"A656","v":654},null,null,null,null,"","",null,""]
[{"$f":"IF($C660=\"\",\"\",MAX($A$3:INDIRECT(\"A\" & TEXT(ROW()-1,\"@\")))+1)","v":658},"Y","シート⑥","H",22,null,"","","",null,"N",null,null,"AB",0,1000,"R",{"$f":"A656","v":654},null,null,null,null,"","",null,""]
[{"$f":"IF($C661=\"\",\"\",MAX($A$3:INDIRECT(\"A\" & TEXT(ROW()-1,\"@\")))+1)","v":659},"Y","シート⑥","I",22,null,"","","",null,"N",null,null,"AB",0,1000,"R",{"$f":"A656","v":654},null,null,null,null,"","",null,""]
[{"$f":"IF($C662=\"\",\"\",MAX($A$3:INDIRECT(\"A\" & TEXT(ROW()-1,\"@\")))+1)","v":660},"Y","シート⑥","J",22,null,"","","",null,"N",null,null,"AB",0,1000,"R",{"$f":"A656","v":654},null,null,null,null,"","",null,""]
[{"$f":"IF($C663=\"\",\"\",MAX($A$3:INDIRECT(\"A\" & TEXT(ROW()-1,\"@\")))+1)","v":661},"Y","シート⑥","K",22,null,"","","",null,"N",null,null,"AB",0,1000,"R",{"$f":"A656","v":654},null,null,null,null,"","",null,""]
[{"$f":"IF($C664=\"\",\"\",MAX($A$3:INDIRECT(\"A\" & TEXT(ROW()-1,\"@\")))+1)","v":662},"Y","シート⑥","L",22,null,"","","",null,"N",null,null,"AB",0,1000,"R",{"$f":"A656","v":654},null,null,null,null,"","",null,""]
[{"$f":"IF($C665=\"\",\"\",MAX($A$3:INDIRECT(\"A\" & TEXT(ROW()-1,\"@\")))+1)","v":663},"Y","シート⑥","M",22,null,"","","",null,"N",null,null,"AB",0,1000,"R",{"$f":"A656","v":654},null,null,null,null,"","",null,""]
[{"$f":"IF($C666=\"\",\"\",MAX($A$3:INDIRECT(\"A\" & TEXT(ROW()-1,\"@\")))+1)","v":664},"Y","シート⑥","N",22,null,"","","",null,"N",null,null,"AB",0,1000,"R",{"$f":"A656","v":654},null,null,null,null,"","",null,""]
[{"$f":"IF($C667=\"\",\"\",MAX($A$3:INDIRECT(\"A\" & TEXT(ROW()-1,\"@\")))+1)","v":665},"Y","シート⑥","O",22,null,"","","",null,"N",null,null,"AB",0,1000,"R",{"$f":"A656","v":654},null,null,null,null,"","",null,""]
[{"$f":"IF($C668=\"\",\"\",MAX($A$3:INDIRECT(\"A\" & TEXT(ROW()-1,\"@\")))+1)","v":666},"Y","シート⑥","C",23,null,"","","",null,null,null,"DATE",null,null,null,null,null,null,null,null,null,"","",null,""]
[{"$f":"IF($C669=\"\",\"\",MAX($A$3:INDIRECT(\"A\" & TEXT(ROW()-1,\"@\")))+1)","v":667},"Y","シート⑥","E",23,null,"","","",null,"N",null,null,"AB",0,1000,"R",{"$f":"A668","v":666},null,null,null,null,"","",null,""]
[{"$f":"IF($C670=\"\",\"\",MAX($A$3:INDIRECT(\"A\" & TEXT(ROW()-1,\"@\")))+1)","v":668},"Y","シート⑥","F",23,null,"","","",null,"N",null,null,"AB",0,1000,"R",{"$f":"A668","v":666},null,null,null,null,"","",null,""]
[{"$f":"IF($C671=\"\",\"\",MAX($A$3:INDIRECT(\"A\" & TEXT(ROW()-1,\"@\")))+1)","v":669},"Y","シート⑥","G",23,null,"","","",null,"N",null,null,"AB",0,1000,"R",{"$f":"A668","v":666},null,null,null,null,"","",null,""]
[{"$f":"IF($C672=\"\",\"\",MAX($A$3:INDIRECT(\"A\" & TEXT(ROW()-1,\"@\")))+1)","v":670},"Y","シート⑥","H",23,null,"","","",null,"N",null,null,"AB",0,1000,"R",{"$f":"A668","v":666},null,null,null,null,"","",null,""]
[{"$f":"IF($C673=\"\",\"\",MAX($A$3:INDIRECT(\"A\" & TEXT(ROW()-1,\"@\")))+1)","v":671},"Y","シート⑥","I",23,null,"","","",null,"N",null,null,"AB",0,1000,"R",{"$f":"A668","v":666},null,null,null,null,"","",null,""]
[{"$f":"IF($C674=\"\",\"\",MAX($A$3:INDIRECT(\"A\" & TEXT(ROW()-1,\"@\")))+1)","v":672},"Y","シート⑥","J",23,null,"","","",null,"N",null,null,"AB",0,1000,"R",{"$f":"A668","v":666},null,null,null,null,"","",null,""]
[{"$f":"IF($C675=\"\",\"\",MAX($A$3:INDIRECT(\"A\" & TEXT(ROW()-1,\"@\")))+1)","v":673},"Y","シート⑥","K",23,null,"","","",null,"N",null,null,"AB",0,1000,"R",{"$f":"A668","v":666},null,null,null,null,"","",null,""]
[{"$f":"IF($C676=\"\",\"\",MAX($A$3:INDIRECT(\"A\" & TEXT(ROW()-1,\"@\")))+1)","v":674},"Y","シート⑥","L",23,null,"","","",null,"N",null,null,"AB",0,1000,"R",{"$f":"A668","v":666},null,null,null,null,"","",null,""]
[{"$f":"IF($C677=\"\",\"\",MAX($A$3:INDIRECT(\"A\" & TEXT(ROW()-1,\"@\")))+1)","v":675},"Y","シート⑥","M",23,null,"","","",null,"N",null,null,"AB",0,1000,"R",{"$f":"A668","v":666},null,null,null,null,"","",null,""]
[{"$f":"IF($C678=\"\",\"\",MAX($A$3:INDIRECT(\"A\" & TEXT(ROW()-1,\"@\")))+1)","v":676},"Y","シート⑥","N",23,null,"","","",null,"N",null,null,"AB",0,1000,"R",{"$f":"A668","v":666},null,null,null,null,"","",null,""]
[{"$f":"IF($C679=\"\",\"\",MAX($A$3:INDIRECT(\"A\" & TEXT(ROW()-1,\"@\")))+1)","v":677},"Y","シート⑥","O",23,null,"","","",null,"N",null,null,"AB",0,1000,"R",{"$f":"A668","v":666},null,null,null,null,"","",null,""]
[{"$f":"IF($C680=\"\",\"\",MAX($A$3:INDIRECT(\"A\" & TEXT(ROW()-1,\"@\")))+1)","v":678},"Y","シート⑥","C",24,null,"","","",null,null,null,"DATE",null,null,null,null,null,null,null,null,null,"","",null,""]
[{"$f":"IF($C681=\"\",\"\",MAX($A$3:INDIRECT(\"A\" & TEXT(ROW()-1,\"@\")))+1)","v":679},"Y","シート⑥","E",24,null,"","","",null,"N",null,null,"AB",0,1000,"R",{"$f":"A680","v":678},null,null,null,null,"","",null,""]
[{"$f":"IF($C682=\"\",\"\",MAX($A$3:INDIRECT(\"A\" & TEXT(ROW()-1,\"@\")))+1)","v":680},"Y","シート⑥","F",24,null,"","","",null,"N",null,null,"AB",0,1000,"R",{"$f":"A680","v":678},null,null,null,null,"","",null,""]
[{"$f":"IF($C683=\"\",\"\",MAX($A$3:INDIRECT(\"A\" & TEXT(ROW()-1,\"@\")))+1)","v":681},"Y","シート⑥","G",24,null,"","","",null,"N",null,null,"AB",0,1000,"R",{"$f":"A680","v":678},null,null,null,null,"","",null,""]
[{"$f":"IF($C684=\"\",\"\",MAX($A$3:INDIRECT(\"A\" & TEXT(ROW()-1,\"@\")))+1)","v":682},"Y","シート⑥","H",24,null,"","","",null,"N",null,null,"AB",0,1000,"R",{"$f":"A680","v":678},null,null,null,null,"","",null,""]
[{"$f":"IF($C685=\"\",\"\",MAX($A$3:INDIRECT(\"A\" & TEXT(ROW()-1,\"@\")))+1)","v":683},"Y","シート⑥","I",24,null,"","","",null,"N",null,null,"AB",0,1000,"R",{"$f":"A680","v":678},null,null,null,null,"","",null,""]
[{"$f":"IF($C686=\"\",\"\",MAX($A$3:INDIRECT(\"A\" & TEXT(ROW()-1,\"@\")))+1)","v":684},"Y","シート⑥","J",24,null,"","","",null,"N",null,null,"AB",0,1000,"R",{"$f":"A680","v":678},null,null,null,null,"","",null,""]
[{"$f":"IF($C687=\"\",\"\",MAX($A$3:INDIRECT(\"A\" & TEXT(ROW()-1,\"@\")))+1)","v":685},"Y","シート⑥","K",24,null,"","","",null,"N",null,null,"AB",0,1000,"R",{"$f":"A680","v":678},null,null,null,null,"","",null,""]
[{"$f":"IF($C688=\"\",\"\",MAX($A$3:INDIRECT(\"A\" & TEXT(ROW()-1,\"@\")))+1)","v":686},"Y","シート⑥","L",24,null,"","","",null,"N",null,null,"AB",0,1000,"R",{"$f":"A680","v":678},null,null,null,null,"","",null,""]
[{"$f":"IF($C689=\"\",\"\",MAX($A$3:INDIRECT(\"A\" & TEXT(ROW()-1,\"@\")))+1)","v":687},"Y","シート⑥","M",24,null,"","","",null,"N",null,null,"AB",0,1000,"R",{"$f":"A680","v":678},null,null,null,null,"","",null,""]
[{"$f":"IF($C690=\"\",\"\",MAX($A$3:INDIRECT(\"A\" & TEXT(ROW()-1,\"@\")))+1)","v":688},"Y","シート⑥","N",24,null,"","","",null,"N",null,null,"AB",0,1000,"R",{"$f":"A680","v":678},null,null,null,null,"","",null,""]
[{"$f":"IF($C691=\"\",\"\",MAX($A$3:INDIRECT(\"A\" & TEXT(ROW()-1,\"@\")))+1)","v":689},"Y","シート⑥","O",24,null,"","","",null,"N",null,null,"AB",0,1000,"R",{"$f":"A680","v":678},null,null,null,null,"","",null,""]
[{"$f":"IF($C692=\"\",\"\",MAX($A$3:INDIRECT(\"A\" & TEXT(ROW()-1,\"@\")))+1)","v":690},"Y","シート⑥","C",25,null,"","","",null,null,null,"DATE",null,null,null,null,null,null,null,null,null,"","",null,""]
[{"$f":"IF($C693=\"\",\"\",MAX($A$3:INDIRECT(\"A\" & TEXT(ROW()-1,\"@\")))+1)","v":691},"Y","シート⑥","E",25,null,"","","",null,"N",null,null,"AB",0,1000,"R",{"$f":"A692","v":690},null,null,null,null,"","",null,""]
[{"$f":"IF($C694=\"\",\"\",MAX($A$3:INDIRECT(\"A\" & TEXT(ROW()-1,\"@\")))+1)","v":692},"Y","シート⑥","F",25,null,"","","",null,"N",null,null,"AB",0,1000,"R",{"$f":"A692","v":690},null,null,null,null,"","",null,""]
[{"$f":"IF($C695=\"\",\"\",MAX($A$3:INDIRECT(\"A\" & TEXT(ROW()-1,\"@\")))+1)","v":693},"Y","シート⑥","G",25,null,"","","",null,"N",null,null,"AB",0,1000,"R",{"$f":"A692","v":690},null,null,null,null,"","",null,""]
[{"$f":"IF($C696=\"\",\"\",MAX($A$3:INDIRECT(\"A\" & TEXT(ROW()-1,\"@\")))+1)","v":694},"Y","シート⑥","H",25,null,"","","",null,"N",null,null,"AB",0,1000,"R",{"$f":"A692","v":690},null,null,null,null,"","",null,""]
[{"$f":"IF($C697=\"\",\"\",MAX($A$3:INDIRECT(\"A\" & TEXT(ROW()-1,\"@\")))+1)","v":695},"Y","シート⑥","I",25,null,"","","",null,"N",null,null,"AB",0,1000,"R",{"$f":"A692","v":690},null,null,null,null,"","",null,""]
[{"$f":"IF($C698=\"\",\"\",MAX($A$3:INDIRECT(\"A\" & TEXT(ROW()-1,\"@\")))+1)","v":696},"Y","シート⑥","J",25,null,"","","",null,"N",null,null,"AB",0,1000,"R",{"$f":"A692","v":690},null,null,null,null,"","",null,""]
[{"$f":"IF($C699=\"\",\"\",MAX($A$3:INDIRECT(\"A\" & TEXT(ROW()-1,\"@\")))+1)","v":697},"Y","シート⑥","K",25,null,"","","",null,"N",null,null,"AB",0,1000,"R",{"$f":"A692","v":690},null,null,null,null,"","",null,""]
[{"$f":"IF($C700=\"\",\"\",MAX($A$3:INDIRECT(\"A\" & TEXT(ROW()-1,\"@\")))+1)","v":698},"Y","シート⑥","L",25,null,"","","",null,"N",null,null,"AB",0,1000,"R",{"$f":"A692","v":690},null,null,null,null,"","",null,""]
[{"$f":"IF($C701=\"\",\"\",MAX($A$3:INDIRECT(\"A\" & TEXT(ROW()-1,\"@\")))+1)","v":699},"Y","シート⑥","M",25,null,"","","",null,"N",null,null,"AB",0,1000,"R",{"$f":"A692","v":690},null,null,null,null,"","",null,""]
[{"$f":"IF($C702=\"\",\"\",MAX($A$3:INDIRECT(\"A\" & TEXT(ROW()-1,\"@\")))+1)","v":700},"Y","シート⑥","N",25,null,"","","",null,"N",null,null,"AB",0,1000,"R",{"$f":"A692","v":690},null,null,null,null,"","",null,""]
[{"$f":"IF($C703=\"\",\"\",MAX($A$3:INDIRECT(\"A\" & TEXT(ROW()-1,\"@\")))+1)","v":701},"Y","シート⑥","O",25,null,"","","",null,"N",null,null,"AB",0,1000,"R",{"$f":"A692","v":690},null,null,null,null,"","",null,""]
[{"$f":"IF($C704=\"\",\"\",MAX($A$3:INDIRECT(\"A\" & TEXT(ROW()-1,\"@\")))+1)","v":702},"Y","シート⑥","E",26,null,"","","",null,null,154,null,null,null,null,null,null,null,null,null,null,"","",null,""]
[{"$f":"IF($C705=\"\",\"\",MAX($A$3:INDIRECT(\"A\" & TEXT(ROW()-1,\"@\")))+1)","v":703},"Y","シート⑥","E",28,null,"有","有","D",null,null,null,null,null,null,null,null,null,null,null,null,null,"","",null,""]
[{"$f":"IF($C706=\"\",\"\",MAX($A$3:INDIRECT(\"A\" & TEXT(ROW()-1,\"@\")))+1)","v":704},"Y","シート⑥","F",28,null,"","","",null,null,null,null,null,null,null,null,null,null,null,null,null,"","",null,""]
[{"$f":"IF($C707=\"\",\"\",MAX($A$3:INDIRECT(\"A\" & TEXT(ROW()-1,\"@\")))+1)","v":705},"Y","シート⑥","G",28,null,"","","",null,null,null,null,null,null,null,null,null,null,null,null,null,{"$f":"IF(AND($B707=\"\",0<COUNTA($J707:$V707)),\"?\",\"\")","v":""},"",null,""]
[{"$f":"IF($C708=\"\",\"\",MAX($A$3:INDIRECT(\"A\" & TEXT(ROW()-1,\"@\")))+1)","v":706},"Y","シート⑥","H",28,null,{"$f":"IFERROR(IF(ISBLANK(INDIRECT($C708 & \"!\" & $D708 & $E708)),\"\",INDIRECT($C708 & \"!\" & $D708 & $E708)),\"\")","v":""},"",{"$f":"IF($F708<>$H708,\"D\",\"\")","v":""},null,null,null,null,null,null,null,null,null,null,null,null,null,"",{"$f":"IF(AND($B708<>\"\",OR($C708=\"\",$D708=\"\",$E708=\"\")),\"?\",\"\")","v":""},null,""]
[{"$f":"IF($C709=\"\",\"\",MAX($A$3:INDIRECT(\"A\" & TEXT(ROW()-1,\"@\")))+1)","v":707},"Y","シート⑥","I",28,null,"","","",null,null,null,null,null,null,null,null,null,null,null,null,null,"","",null,{"$f":"IF(AND($H709<>\"\",$Y709<>\"\"),$H709,\"\")","v":""}]
[{"$f":"IF($C710=\"\",\"\",MAX($A$3:INDIRECT(\"A\" & TEXT(ROW()-1,\"@\")))+1)","v":708},"Y","シート⑥","J",28,null,"",{"$f":"IF(AND($B710<>\"\",$G710<>\"\"),$G710,\"\")","v":""},"",null,null,null,null,null,null,null,null,null,null,null,null,null,"","",null,""]
[{"$f":"IF($C711=\"\",\"\",MAX($A$3:INDIRECT(\"A\" & TEXT(ROW()-1,\"@\")))+1)","v":709},"Y","シート⑥","K",28,null,"","","",null,null,null,null,null,null,null,null,null,null,null,null,null,"","",null,""]
[{"$f":"IF($C712=\"\",\"\",MAX($A$3:INDIRECT(\"A\" & TEXT(ROW()-1,\"@\")))+1)","v":710},"Y","シート⑥","L",28,null,"","","",null,null,null,null,null,null,null,null,null,null,null,null,null,"","",null,""]
[{"$f":"IF($C713=\"\",\"\",MAX($A$3:INDIRECT(\"A\" & TEXT(ROW()-1,\"@\")))+1)","v":711},"Y","シート⑥","M",28,null,"","","",null,null,null,null,null,null,null,null,null,null,null,null,null,"","",null,""]
[{"$f":"IF($C714=\"\",\"\",MAX($A$3:INDIRECT(\"A\" & TEXT(ROW()-1,\"@\")))+1)","v":712},"Y","シート⑥","N",28,null,"","","",null,null,null,null,null,null,null,null,null,null,null,null,null,"","",null,""]
[{"$f":"IF($C715=\"\",\"\",MAX($A$3:INDIRECT(\"A\" & TEXT(ROW()-1,\"@\")))+1)","v":713},"Y","シート⑥","O",28,null,"","","",null,null,null,null,null,null,null,null,null,null,null,null,null,"","",null,""]
[{"$f":"IF($C716=\"\",\"\",MAX($A$3:INDIRECT(\"A\" & TEXT(ROW()-1,\"@\")))+1)","v":714},"Y","シート⑥","E",29,null,42941,42941,"D",null,null,null,"DATE",null,null,null,null,null,null,null,null,null,"","",null,""]
[{"$f":"IF($C717=\"\",\"\",MAX($A$3:INDIRECT(\"A\" & TEXT(ROW()-1,\"@\")))+1)","v":715},"Y","シート⑥","F",29,null,"","","",null,null,null,"DATE",null,null,null,null,null,null,null,null,null,"","",null,""]
[{"$f":"IF($C718=\"\",\"\",MAX($A$3:INDIRECT(\"A\" & TEXT(ROW()-1,\"@\")))+1)","v":716},"Y","シート⑥","G",29,null,"","","",null,null,null,"DATE",null,null,null,null,null,null,null,null,null,"","",null,""]
[{"$f":"IF($C719=\"\",\"\",MAX($A$3:INDIRECT(\"A\" & TEXT(ROW()-1,\"@\")))+1)","v":717},"Y","シート⑥","H",29,null,"","","",null,null,null,"DATE",null,null,null,null,null,null,null,null,null,"","",null,""]
[{"$f":"IF($C720=\"\",\"\",MAX($A$3:INDIRECT(\"A\" & TEXT(ROW()-1,\"@\")))+1)","v":718},"Y","シート⑥","I",29,null,"","","",null,null,null,"DATE",null,null,null,null,null,null,null,null,null,"","",null,""]
[{"$f":"IF($C721=\"\",\"\",MAX($A$3:INDIRECT(\"A\" & TEXT(ROW()-1,\"@\")))+1)","v":719},"Y","シート⑥","J",29,null,"","","",null,null,null,"DATE",null,null,null,null,null,null,null,null,null,"","",null,""]
[{"$f":"IF($C722=\"\",\"\",MAX($A$3:INDIRECT(\"A\" & TEXT(ROW()-1,\"@\")))+1)","v":720},"Y","シート⑥","K",29,null,"","","",null,null,null,"DATE",null,null,null,null,null,null,null,null,null,"","",null,""]
[{"$f":"IF($C723=\"\",\"\",MAX($A$3:INDIRECT(\"A\" & TEXT(ROW()-1,\"@\")))+1)","v":721},"Y","シート⑥","L",29,null,"","","",null,null,null,"DATE",null,null,null,null,null,null,null,null,null,"","",null,""]
[{"$f":"IF($C724=\"\",\"\",MAX($A$3:INDIRECT(\"A\" & TEXT(ROW()-1,\"@\")))+1)","v":722},"Y","シート⑥","M",29,null,"","","",null,null,null,"DATE",null,null,null,null,null,null,null,null,null,"","",null,""]
[{"$f":"IF($C725=\"\",\"\",MAX($A$3:INDIRECT(\"A\" & TEXT(ROW()-1,\"@\")))+1)","v":723},"Y","シート⑥","N",29,null,"","","",null,null,null,"DATE",null,null,null,null,null,null,null,null,null,"","",null,""]
[{"$f":"IF($C726=\"\",\"\",MAX($A$3:INDIRECT(\"A\" & TEXT(ROW()-1,\"@\")))+1)","v":724},"Y","シート⑥","O",29,null,"","","",null,null,null,"DATE",null,null,null,null,null,null,null,null,null,"","",null,""]
[{"$f":"IF($C727=\"\",\"\",MAX($A$3:INDIRECT(\"A\" & TEXT(ROW()-1,\"@\")))+1)","v":725},"Y","シート⑥","E",30,null,"注入","注入","D",null,null,4,null,null,null,null,null,null,null,null,null,null,"","",null,""]
[{"$f":"IF($C728=\"\",\"\",MAX($A$3:INDIRECT(\"A\" & TEXT(ROW()-1,\"@\")))+1)","v":726},"Y","シート⑥","F",30,null,"","","",null,null,4,null,null,null,null,null,null,null,null,null,null,"","",null,""]
[{"$f":"IF($C729=\"\",\"\",MAX($A$3:INDIRECT(\"A\" & TEXT(ROW()-1,\"@\")))+1)","v":727},"Y","シート⑥","G",30,null,"","","",null,null,4,null,null,null,null,null,null,null,null,null,null,"","",null,""]
[{"$f":"IF($C730=\"\",\"\",MAX($A$3:INDIRECT(\"A\" & TEXT(ROW()-1,\"@\")))+1)","v":728},"Y","シート⑥","H",30,null,"","","",null,null,4,null,null,null,null,null,null,null,null,null,null,"","",null,""]
[{"$f":"IF($C731=\"\",\"\",MAX($A$3:INDIRECT(\"A\" & TEXT(ROW()-1,\"@\")))+1)","v":729},"Y","シート⑥","I",30,null,"","","",null,null,4,null,null,null,null,null,null,null,null,null,null,"","",null,""]
[{"$f":"IF($C732=\"\",\"\",MAX($A$3:INDIRECT(\"A\" & TEXT(ROW()-1,\"@\")))+1)","v":730},"Y","シート⑥","J",30,null,"","","",null,null,4,null,null,null,null,null,null,null,null,null,null,"","",null,""]
[{"$f":"IF($C733=\"\",\"\",MAX($A$3:INDIRECT(\"A\" & TEXT(ROW()-1,\"@\")))+1)","v":731},"Y","シート⑥","K",30,null,"","","",null,null,4,null,null,null,null,null,null,null,null,null,null,"","",null,""]
[{"$f":"IF($C734=\"\",\"\",MAX($A$3:INDIRECT(\"A\" & TEXT(ROW()-1,\"@\")))+1)","v":732},"Y","シート⑥","L",30,null,"","","",null,null,4,null,null,null,null,null,null,null,null,null,null,"","",null,""]
[{"$f":"IF($C735=\"\",\"\",MAX($A$3:INDIRECT(\"A\" & TEXT(ROW()-1,\"@\")))+1)","v":733},"Y","シート⑥","M",30,null,"","","",null,null,4,null,null,null,null,null,null,null,null,null,null,"","",null,""]
[{"$f":"IF($C736=\"\",\"\",MAX($A$3:INDIRECT(\"A\" & TEXT(ROW()-1,\"@\")))+1)","v":734},"Y","シート⑥","N",30,null,"","","",null,null,4,null,null,null,null,null,null,null,null,null,null,"","",null,""]
[{"$f":"IF($C737=\"\",\"\",MAX($A$3:INDIRECT(\"A\" & TEXT(ROW()-1,\"@\")))+1)","v":735},"Y","シート⑥","O",30,null,"","","",null,null,4,null,null,null,null,null,null,null,null,null,null,"","",null,""]
[{"$f":"IF($C738=\"\",\"\",MAX($A$3:INDIRECT(\"A\" & TEXT(ROW()-1,\"@\")))+1)","v":736},"Y","シート⑥","E",31,null,"軟質系エポキシ樹脂注入","軟質系エポキシ樹脂注入","D",null,null,77,null,null,null,null,null,null,null,null,null,null,"","",null,""]
["_e","_e","_e","_e","_e","_e","_e","_e","_e","_e","_e","_e","_e","_e","_e","_e","_e","_e","_e",null,null,"_e","_e","_e","_e","_e","_e"]